{"text_format":"1","workbook":"xlsx","n_sheets":12,"sheets":["Buttons","ObsvEqmt","Results","Calculation","CalcAAVSO","Data charts","Data charts AAVSO","BAAVSS","AAVSO","Image","Data","Version Log"],"not_rendered":{"charts":8,"images":31,"macros":1,"external_links":0,"defined_names":63,"comments":1,"pivot_tables":0},"unopened":[],"bounds":{"document_bytes":16777216,"sheet_cells":100000,"rows_first":2000,"rows_last":500,"rows_between":2000,"halvings":0,"cell_chars":16384,"cell_head_chars":4096},"cells_cut":0,"cells_raw":0,"read":"whole","date_system":"1900"}

{"sheet":"Buttons","index":0,"n_rows":3,"n_cols":26,"rows_kept":3,"cut":false,"hidden":false,"merged":[]}
[null,null,null,null,null,null,null,null,null,null,null,null,null,null,null,null,null,null,null,null,null,null,null,null,null,"Photometry File Types"]
[null,null,null,null,null,null,null,null,null,null,null,null,null,null,null,null,null,null,null,null,null,null,null,null,null,"AIP4Win v2 - Ensemble Photometry"]
[null,null,null,null,null,null,null,null,null,null,null,null,null,null,null,null,null,null,null,null,null,null,null,null,null,"Mira AP"]

{"sheet":"ObsvEqmt","index":1,"n_rows":31,"n_cols":6,"rows_kept":31,"cut":false,"hidden":false,"merged":[[5,2,5,5],[16,2,16,5],[22,2,22,3],[3,2,3,3],[8,2,8,3],[4,2,4,3],[15,2,15,5]]}
[null,"Observer & Equipment Details",null,null,null,"Red - Required, Blue - Optional"]
[]
[null,"Observer Details"]
[null,"BAAVSS Observer Code","ABC"]
[null,"AAVSO Observer Code","DEF"]
[null,"Observer Name","Optional Name"]
[]
[null,"Location Details"]
[null,"Location Code","No longer used"]
[null,null,"Deg","Min","Sec","Hem"]
[null,"Latitude",51,1,0,"N"]
[null,"Longitude",1,1,0,"W"]
[null,"Height (m)",10]
[]
[null,"Telescope Details"]
[null,"Telescope Short Description","Meade 14 LX200R on AP1200"]
[null,"Description","Meade SCT"]
[null,"Aperture (mm)",356]
[null,"Focal Length (mm)",2480]
[]
[null,"Camera Details"]
[null,"Observation Method","CCD"]
[null,"Camera","SXVR-H694"]
[null,"Pixel Size (arcsec)",0.755,0.755]
[null,"Gain (e-/ADU)",0.3]
[null,"Dark Current (e-/pixel)",1E-3]
[null,"Readout Noise (e-/pixel)",5]
[]
[null,"Spreadsheet"]
[null,"Version",{"$f":"INDIRECT(\"'Version Log'!\"&\"A\"&COUNTA('Version Log'!A:A))","v":"2.04"}]
[null,"Release Date","2017-12-30"]

{"sheet":"Results","index":2,"n_rows":47,"n_cols":24,"rows_kept":47,"cut":false,"hidden":false,"merged":[[8,17,8,20],[9,5,9,6],[8,2,8,6],[2,10,2,13],[3,6,3,7],[4,6,4,7],[8,11,8,14],[8,7,8,10],[3,10,3,12],[2,6,2,7],[4,10,4,11],[4,12,4,17]]}
[null,"Observation Summary",null,null,"Red - Required, Blue - Optional, Green - Calculated/Automated",null,null,null,null,null,null,null,null,null,null,null,null,null,null,null,null,null,"Filter","Explanation"]
[null,null,null,null,null,null,null,null,null,null,null,null,null,null,null,null,null,null,null,null,null,null,"CV","Clear (unfiltered) V-band comp star mag (more common than CR)"]
[null,"Chart","AAVSO 12662FGO","Star Aperture",10,null,"Airmass",null,null,null,"Red Warning Limit (Used in Data Checks)",null,null,null,null,null,null,null,null,null,null,null,"CR","Clear (unfiltered) R-band comp star mag"]
[null,"Filter","V","Sky Annulus Inner Radius",15,null,"Observations per Block Average",null,5,null,"Max Calc - Quoted Difference",null,null,0.05,null,null,null,null,null,null,null,null,"U","Johnson U"]
[null,"Photometry Time Stamp","Start Exposure","Sky Annulus Outer Radius",20,null,"Julian Date Offset",null,2453000,null,"Comment",null,null,null,null,null,null,null,null,null,null,null,"B","Johnson B"]
[null,"Timing Error",30,null,null,null,null,null,null,null,null,null,null,null,null,null,null,null,null,null,null,null,"V","Johnson V"]
[null,null,null,null,null,null,null,null,null,null,null,null,null,null,null,null,null,null,null,null,null,null,"R","Cousins R"]
[null,"Star Data & Summary Calculations",null,"(Individual Variable Measurements to Right)",null,null,null,null,null,null,null,null,null,null,null,null,null,null,null,null,null,null,"I","Cousins I"]
[null,null,"User Input",null,null,null,null,"Results",null,null,null,"Data Checks (Cells Turn Red when Limit Exceeded)",null,null,null,null,null,"Individual Variable Measurements",null,null,null,null,"J","NIR 1.2 micron"]
[null,null,"Star","AIP4WIN","Include in","Reference",null,"Average","Average","Std Dev","Average","Calc - Quoted","Min","Max","Magnitude",null,null,"Date","Julian","Magnitude","Error",null,"H","NIR 1.6 micron"]
[null,"Type","Designation","Star","Analysis","Magnitude","Error","Magnitude","Error","Magnitude","Weight","Difference","Magnitude","Magnitude","Check",null,null,"/Time","Date",null,null,null,"K","NIR 2.2 micron"]
[null,"AAVSO Results",{"$f":"oVariableID","v":"VW Vul"},{"$f":"D13","v":"Var"},null,null,null,{"$f":"AVERAGE(CalcAAVSO!$BW$7:$BW$9)","v":15.386619975654389},{"$f":"AVERAGE(CalcAAVSO!$BX$7:$BX$9)","v":7.2437678638041583E-2},{"$f":"STDEV(CalcAAVSO!$BW$7:$BW$9)","v":1.3124315573513562E-2},null,null,{"$f":"MAX(CalcAAVSO!$BW$7:$BW$9)","v":15.398073269406774},{"$f":"MIN(CalcAAVSO!$BW$7:$BW$9)","v":15.372298900004894},null,null,"Average","N/A","N/A",{"$f":"Calculation!$BW5","v":15.386723833505906},{"$f":"Calculation!$BX5","v":7.2417994119986687E-2},null,"VG","Corrected Green Channel to Johnson V"]
[null,"BAAVSS Results","VW Vul","Var",null,null,null,{"$f":"AVERAGE(Calculation!$BW$7:$BW$9)","v":15.386723833505906},{"$f":"AVERAGE(Calculation!$BX$7:$BX$9)","v":7.2417994119986687E-2},{"$f":"STDEV(Calculation!$BW$7:$BW$9)","v":1.2910443235815907E-2},{"$f":"AVERAGE(Calculation!$AJ$7:$AJ$9)","v":0},{"$f":"$H$13-$F$13","v":15.386723833505906},{"$f":"MAX(Calculation!$BW$7:$BW$9)","v":15.397930211732355},{"$f":"MIN(Calculation!$BW$7:$BW$9)","v":15.372606399867795},{"$f":"IF(ABS($L$13)>oMagTol,\"WARNING\",\"OK\")","v":"WARNING"},null,"Std Dev","N/A","N/A",{"$f":"Calculation!$BW6","v":1.2910443235815907E-2},{"$f":"Calculation!$BX6","v":2.1077228768310681E-3},null,"TR","Red Filter (tricolour)"]
[null,"Comparison",119,"C1","No",11.935,8.0000000000000002E-3,{"$f":"AVERAGE(Calculation!$BY$7:$BY$9)","v":11.96105716683924},{"$f":"AVERAGE(Calculation!$BZ$7:$BZ$9)","v":6.0615349612554931E-3},{"$f":"STDEV(Calculation!$BY$7:$BY$9)","v":1.1486281688757434E-2},{"$f":"AVERAGE(Calculation!$AM$7:$AM$9)","v":0},{"$f":"$H$14-$F$14","v":2.6057166839239088E-2},{"$f":"MAX(Calculation!$BY$7:$BY$9)","v":11.972606399867797},{"$f":"MIN(Calculation!$BY$7:$BY$9)","v":11.949634888917569},{"$f":"IF(ABS($L$14)>oMagTol,\"WARNING\",\"OK\")","v":"OK"},null,null,{"$f":"Calculation!C7+Calculation!D7","v":"2013-10-05T19:58:54"},{"$f":"Calculation!F7","v":3571.332570000086},{"$f":"Calculation!$BW7","v":15.372606399867795},{"$f":"Calculation!$BX7","v":7.4036516987994599E-2},null,"TG","Green Filter (tricolour)"]
[null,"Comparison",127,"C2","Yes",12.664999999999999,8.0000000000000002E-3,{"$f":"AVERAGE(Calculation!$CA$7:$CA$9)","v":12.656723833505906},{"$f":"AVERAGE(Calculation!$CB$7:$CB$9)","v":8.1791023308938823E-3},{"$f":"STDEV(Calculation!$CA$7:$CA$9)","v":6.7177299468663366E-3},{"$f":"AVERAGE(Calculation!$AP$7:$AP$9)","v":0.36622122093799353},{"$f":"$H$15-$F$15","v":-8.2761664940935731E-3},{"$f":"MAX(Calculation!$CA$7:$CA$9)","v":12.663930211732353},{"$f":"MIN(Calculation!$CA$7:$CA$9)","v":12.650634888917567},{"$f":"IF(ABS($L$15)>oMagTol,\"WARNING\",\"OK\")","v":"OK"},null,null,{"$f":"Calculation!C8+Calculation!D8","v":"2013-10-05T19:59:57"},{"$f":"Calculation!F8","v":3571.3333000000566},{"$f":"Calculation!$BW8","v":15.397930211732355},{"$f":"Calculation!$BX8","v":7.3182830370314492E-2},null,"TB","Blue Filter (tricolour)"]
[null,"Comparison",131,"C3","Yes",13.098000000000001,0.01,{"$f":"AVERAGE(Calculation!$CC$7:$CC$9)","v":13.091723833505904},{"$f":"AVERAGE(Calculation!$CD$7:$CD$9)","v":1.0640428479261122E-2},{"$f":"STDEV(Calculation!$CC$7:$CC$9)","v":4.2777395908722782E-3},{"$f":"AVERAGE(Calculation!$AS$7:$AS$9)","v":0.20906152523652033},{"$f":"$H$16-$F$16","v":-6.2761664940964579E-3},{"$f":"MAX(Calculation!$CC$7:$CC$9)","v":13.096606399867795},{"$f":"MIN(Calculation!$CC$7:$CC$9)","v":13.088634888917568},{"$f":"IF(ABS($L$16)>oMagTol,\"WARNING\",\"OK\")","v":"OK"},null,null,{"$f":"Calculation!C9+Calculation!D9","v":"2013-10-05T20:01:00"},{"$f":"Calculation!F9","v":3571.3340300000273},{"$f":"Calculation!$BW9","v":15.389634888917566},{"$f":"Calculation!$BX9","v":7.0034635001650969E-2},null,"SU","Sloan U"]
[null,"Comparison",134,"C4","Yes",13.439,6.0000000000000001E-3,{"$f":"AVERAGE(Calculation!$CE$7:$CE$9)","v":13.458390500172571},{"$f":"AVERAGE(Calculation!$CF$7:$CF$9)","v":1.3874604173175292E-2},{"$f":"STDEV(Calculation!$CE$7:$CE$9)","v":3.8627493620422455E-3},{"$f":"AVERAGE(Calculation!$AV$7:$AV$9)","v":0.19377539632034446},{"$f":"$H$17-$F$17","v":1.9390500172571379E-2},{"$f":"MAX(Calculation!$CE$7:$CE$9)","v":13.460634888917568},{"$f":"MIN(Calculation!$CE$7:$CE$9)","v":13.453930211732352},{"$f":"IF(ABS($L$17)>oMagTol,\"WARNING\",\"OK\")","v":"OK"},null,null,null,null,null,null,null,"SG","Sloan G"]
[null,"Comparison",137,"C5","Yes",13.74,8.0000000000000002E-3,{"$f":"AVERAGE(Calculation!$CG$7:$CG$9)","v":13.744057166839241},{"$f":"AVERAGE(Calculation!$CH$7:$CH$9)","v":1.7308303351463741E-2},{"$f":"STDEV(Calculation!$CG$7:$CG$9)","v":1.0163398433596316E-2},{"$f":"AVERAGE(Calculation!$AY$7:$AY$9)","v":0.11720224340846019},{"$f":"$H$18-$F$18","v":4.0571668392406224E-3},{"$f":"MAX(Calculation!$CG$7:$CG$9)","v":13.755634888917569},{"$f":"MIN(Calculation!$CG$7:$CG$9)","v":13.736606399867796},{"$f":"IF(ABS($L$18)>oMagTol,\"WARNING\",\"OK\")","v":"OK"},null,null,null,null,null,null,null,"SR","Sloan R"]
[null,"Comparison",142,"C6","Yes",14.224,8.0000000000000002E-3,{"$f":"AVERAGE(Calculation!$CI$7:$CI$9)","v":14.222057166839241},{"$f":"AVERAGE(Calculation!$CJ$7:$CJ$9)","v":2.5792684628174866E-2},{"$f":"STDEV(Calculation!$CI$7:$CI$9)","v":1.3040573188108957E-2},{"$f":"AVERAGE(Calculation!$BB$7:$BB$9)","v":5.6651434746963082E-2},{"$f":"$H$19-$F$19","v":-1.942833160759605E-3},{"$f":"MAX(Calculation!$CI$7:$CI$9)","v":14.233634888917567},{"$f":"MIN(Calculation!$CI$7:$CI$9)","v":14.207930211732354},{"$f":"IF(ABS($L$19)>oMagTol,\"WARNING\",\"OK\")","v":"OK"},null,null,null,null,null,null,null,"SI","Sloan I"]
[null,"Comparison",145,"C7","Yes",14.489000000000001,5.0000000000000001E-3,{"$f":"AVERAGE(Calculation!$CK$7:$CK$9)","v":14.499057166839242},{"$f":"AVERAGE(Calculation!$CL$7:$CL$9)","v":3.2867213225602467E-2},{"$f":"STDEV(Calculation!$CK$7:$CK$9)","v":1.9049703151570692E-3},{"$f":"AVERAGE(Calculation!$BE$7:$BE$9)","v":3.6987504145576632E-2},{"$f":"$H$20-$F$20","v":1.005716683924085E-2},{"$f":"MAX(Calculation!$CK$7:$CK$9)","v":14.500606399867795},{"$f":"MIN(Calculation!$CK$7:$CK$9)","v":14.496930211732355},{"$f":"IF(ABS($L$20)>oMagTol,\"WARNING\",\"OK\")","v":"OK"},null,null,null,null,null,null,null,"SZ","Sloan Z"]
[null,"Comparison",148,"C8","No",14.83,1.7999999999999999E-2,{"$f":"AVERAGE(Calculation!$CM$7:$CM$9)","v":14.77105716683924},{"$f":"AVERAGE(Calculation!$CN$7:$CN$9)","v":4.2026529976459837E-2},{"$f":"STDEV(Calculation!$CM$7:$CM$9)","v":3.5548079127369896E-2},{"$f":"AVERAGE(Calculation!$BH$7:$BH$9)","v":0},{"$f":"$H$21-$F$21","v":-5.8942833160759989E-2},{"$f":"MAX(Calculation!$CM$7:$CM$9)","v":14.798606399867797},{"$f":"MIN(Calculation!$CM$7:$CM$9)","v":14.730930211732353},{"$f":"IF(ABS($L$21)>oMagTol,\"WARNING\",\"OK\")","v":"WARNING"}]
[null,"Comparison",151,"C9","Yes",15.112,6.0000000000000001E-3,{"$f":"AVERAGE(Calculation!$CO$7:$CO$9)","v":15.107390500172571},{"$f":"AVERAGE(Calculation!$CP$7:$CP$9)","v":5.6360041716459836E-2},{"$f":"STDEV(Calculation!$CO$7:$CO$9)","v":2.0410902640776461E-2},{"$f":"AVERAGE(Calculation!$BK$7:$BK$9)","v":1.2557462762985376E-2},{"$f":"$H$22-$F$22","v":-4.6094998274295307E-3},{"$f":"MAX(Calculation!$CO$7:$CO$9)","v":15.128634888917567},{"$f":"MIN(Calculation!$CO$7:$CO$9)","v":15.087930211732353},{"$f":"IF(ABS($L$22)>oMagTol,\"WARNING\",\"OK\")","v":"OK"}]
[null,"Comparison",154,"C10","Check",15.398999999999999,1.0999999999999999E-2,{"$f":"AVERAGE(Calculation!$CQ$7:$CQ$9)","v":15.386057166839239},{"$f":"AVERAGE(Calculation!$CR$7:$CR$9)","v":7.2252554858693863E-2},{"$f":"STDEV(Calculation!$CQ$7:$CQ$9)","v":3.0525258276752839E-2},{"$f":"AVERAGE(Calculation!$BN$7:$BN$9)","v":7.543212441156473E-3},{"$f":"$H$23-$F$23","v":-1.2942833160760614E-2},{"$f":"MAX(Calculation!$CQ$7:$CQ$9)","v":15.418930211732352},{"$f":"MIN(Calculation!$CQ$7:$CQ$9)","v":15.358606399867796},{"$f":"IF(ABS($L$23)>oMagTol,\"WARNING\",\"OK\")","v":"OK"}]
[null,"Comparison",157,"C11","No",15.659000000000001,0,{"$f":"AVERAGE(Calculation!$CS$7:$CS$9)","v":15.732390500172571},{"$f":"AVERAGE(Calculation!$CT$7:$CT$9)","v":9.9875521122420041E-2},{"$f":"STDEV(Calculation!$CS$7:$CS$9)","v":2.73529776440045E-2},{"$f":"AVERAGE(Calculation!$BQ$7:$BQ$9)","v":0},{"$f":"$H$24-$F$24","v":7.3390500172569872E-2},{"$f":"MAX(Calculation!$CS$7:$CS$9)","v":15.759634888917567},{"$f":"MIN(Calculation!$CS$7:$CS$9)","v":15.704930211732353},{"$f":"IF(ABS($L$24)>oMagTol,\"WARNING\",\"OK\")","v":"WARNING"}]
[null,"Comparison",168,"C12","No",16.771000000000001,1.4E-2,{"$f":"AVERAGE(Calculation!$CU$7:$CU$9)","v":16.918723833505904},{"$f":"AVERAGE(Calculation!$CV$7:$CV$9)","v":0.29493709756540049},{"$f":"STDEV(Calculation!$CU$7:$CU$9)","v":6.2345226940267104E-2},{"$f":"AVERAGE(Calculation!$BT$7:$BT$9)","v":0},{"$f":"$H$25-$F$25","v":0.14772383350590346},{"$f":"MAX(Calculation!$CU$7:$CU$9)","v":16.981606399867797},{"$f":"MIN(Calculation!$CU$7:$CU$9)","v":16.856930211732355},{"$f":"IF(ABS($L$25)>oMagTol,\"WARNING\",\"OK\")","v":"WARNING"}]
[null,"Comparison"]
[null,"Comparison"]
[null,"Comparison"]
[null,"Comparison"]
[null,"Comparison"]
[null,"Comparison"]
[null,"Comparison"]
[null,"Comparison"]
[null,"Comparison"]
[null,"Comparison"]
[null,"Comparison"]
[null,"Comparison"]
[null,"Comparison"]
[null,"Comparison"]
[null,"Comparison"]
[null,"Comparison"]
[null,"Comparison"]
[null,"Comparison"]
[null,"Comparison"]
[null,"Comparison"]
[null,"Comparison"]
[null,"Comparison"]

{"sheet":"Calculation","index":3,"n_rows":9,"n_cols":103,"rows_kept":9,"cut":false,"hidden":false,"merged":[[0,100,0,102],[0,33,0,36],[0,72,0,73],[0,74,0,77]]}
[null,"Image Data",null,null,null,null,null,null,null,null,null,null,null,null,null,null,null,null,null,null,null,null,null,null,null,null,null,null,null,null,null,null,null,"Intermediate Calculations",null,null,null,null,null,null,null,null,null,null,null,null,null,null,null,null,null,null,null,null,null,null,null,null,null,null,null,null,null,null,null,null,null,null,null,null,null,null,"Zero Point Calculations",null,"Final Derived Calculations",null,null,null,null,null,null,null,null,null,null,null,null,null,null,null,null,null,null,null,null,null,null,null,null,null,"Block Average Calculations"]
[null,null,null,null,null,null,null,null,null,null,null,null,null,null,null,null,null,null,null,null,null,null,null,null,null,null,null,null,null,null,null,null,null,null,null,null,"Include",{"$f":"IF(OR(Results!$E$14=\"Yes\",Results!$E$14=\"Check\"),1,0)","v":0},null,"Include",{"$f":"IF(OR(Results!$E$15=\"Yes\",Results!$E$15=\"Check\"),1,0)","v":1},null,"Include",{"$f":"IF(OR(Results!$E$16=\"Yes\",Results!$E$16=\"Check\"),1,0)","v":1},null,"Include",{"$f":"IF(OR(Results!$E$17=\"Yes\",Results!$E$17=\"Check\"),1,0)","v":1},null,"Include",{"$f":"IF(OR(Results!$E$18=\"Yes\",Results!$E$18=\"Check\"),1,0)","v":1},null,"Include",{"$f":"IF(OR(Results!$E$19=\"Yes\",Results!$E$19=\"Check\"),1,0)","v":1},null,"Include",{"$f":"IF(OR(Results!$E$20=\"Yes\",Results!$E$20=\"Check\"),1,0)","v":1},null,"Include",{"$f":"IF(OR(Results!$E$21=\"Yes\",Results!$E$21=\"Check\"),1,0)","v":0},null,"Include",{"$f":"IF(OR(Results!$E$22=\"Yes\",Results!$E$22=\"Check\"),1,0)","v":1},null,"Include",{"$f":"IF(OR(Results!$E$23=\"Yes\",Results!$E$23=\"Check\"),1,0)","v":1},null,"Include",{"$f":"IF(OR(Results!$E$24=\"Yes\",Results!$E$24=\"Check\"),1,0)","v":0},null,"Include",{"$f":"IF(OR(Results!$E$25=\"Yes\",Results!$E$25=\"Check\"),1,0)","v":0},null,"Comparisons",{"$f":"SUM($AH$2:$BT$2)","v":8}]
[null,null,null,null,null,null,"Exposure","Var",null,"C1",null,"C2",null,"C3",null,"C4",null,"C5",null,"C6",null,"C7",null,"C8",null,"C9",null,"C10",null,"C11",null,"C12",null,"Var",null,null,"C1",null,null,"C2",null,null,"C3",null,null,"C4",null,null,"C5",null,null,"C6",null,null,"C7",null,null,"C8",null,null,"C9",null,null,"C10",null,null,"C11",null,null,"C12",null,null,null,null,"Var",null,"C1",null,"C2",null,"C3",null,"C4",null,"C5",null,"C6",null,"C7",null,"C8",null,"C9",null,"C10",null,"C11",null,"C12",null,"Var"]
[null,"Image Name","Date","Time","Julian Date",{"$f":"\"JD-\"&oJDOffset","v":"JD-2453000"},"Length","InstMag","Error","InstMag","Error","InstMag","Error","InstMag","Error","InstMag","Error","InstMag","Error","InstMag","Error","InstMag","Error","InstMag","Error","InstMag","Error","InstMag","Error","InstMag","Error","InstMag","Error","Magnitude","1/SumSqErr","Weight","Magnitude","1/SumSqErr","Weight","Magnitude","1/SumSqErr","Weight","Magnitude","1/SumSqErr","Weight","Magnitude","1/SumSqErr","Weight","Magnitude","1/SumSqErr","Weight","Magnitude","1/SumSqErr","Weight","Magnitude","1/SumSqErr","Weight","Magnitude","1/SumSqErr","Weight","Magnitude","1/SumSqErr","Weight","Magnitude","1/SumSqErr","Weight","Magnitude","1/SumSqErr","Weight","Magnitude","1/SumSqErr","Weight","Wt Mean ZP Mag","Wt ZP Std Err","Magnitude","Error","Magnitude","Error","Magnitude","Error","Magnitude","Error","Magnitude","Error","Magnitude","Error","Magnitude","Error","Magnitude","Error","Magnitude","Error","Magnitude","Error","Magnitude","Error","Magnitude","Error","Magnitude","Error","Julian Date","Magnitude","Error"]
["Mean",{"$f":"IF(ISERROR(AVERAGE(B7:B9)),\"Not Calc\",AVERAGE(B7:B9))","v":"Not Calc"},"2013-10-05","19:59:57",2456571.3333000001,3571.3333000000566,60,18.335999999999999,7.226666666666666E-2,14.910333333333334,3.933333333333333E-3,15.606,6.7333333333333334E-3,16.041,9.566666666666666E-3,16.407666666666668,1.3066666666666666E-2,16.693333333333332,1.6666666666666666E-2,17.171333333333333,2.5366666666666666E-2,17.448333333333334,3.2533333333333331E-2,17.720333333333333,4.1766666666666667E-2,18.056666666666665,5.616666666666667E-2,18.335333333333335,7.2099999999999997E-2,18.681666666666665,9.976666666666667E-2,19.868000000000002,0.2949,{"$f":"IF(ISERROR(AVERAGE(AH7:AH9)),\"Not Calc\",AVERAGE(AH7:AH9))","v":"Not Calc"},"Not Calc",0,0,0,0,-2.9410000000000007,9147.5509658126084,0.36622122093799353,-2.9429999999999996,5223.3970658481367,0.20906152523652033,-2.9686666666666661,4844.3832322362205,0.19377539632034446,-2.9533333333333336,2929.7879170160745,0.11720224340846019,-2.9473333333333329,1416.4806172536053,5.6651434746963082E-2,-2.9593333333333334,924.82639063671377,3.6987504145576632E-2,0,0,0,-2.9446666666666661,313.84732037253031,1.2557462762985376E-2,-2.9363333333333341,188.65450402040221,{"$f":"IF(ISERROR(AVERAGE(BN7:BN9)),\"Not Calc\",AVERAGE(BN7:BN9))","v":7.543212441156473E-3},0,0,0,0,0,0,-2.9492761664940943,4.5676295383337041E-3,15.386723833505906,7.2417994119986687E-2,11.96105716683924,6.0615349612554931E-3,12.656723833505906,8.1791023308938823E-3,13.091723833505904,1.0640428479261122E-2,13.458390500172571,1.3874604173175292E-2,13.744057166839241,1.7308303351463741E-2,14.222057166839241,2.5792684628174866E-2,14.499057166839242,3.2867213225602467E-2,14.77105716683924,4.2026529976459837E-2,15.107390500172571,5.6360041716459836E-2,15.386057166839239,7.2252554858693863E-2,15.732390500172571,{"$f":"IF(ISERROR(AVERAGE(CT7:CT9)),\"Not Calc\",AVERAGE(CT7:CT9))","v":9.9875521122420041E-2},16.918723833505904,0.29493709756540049,"Not Calc","Not Calc","Not Calc"]
["StDev",{"$f":"IF(ISERROR(STDEV(B7:B9)),\"Not Calc\",STDEV(B7:B9))","v":"Not Calc"},"00:00:00","00:01:03",7.2999997064471245E-4,7.2999997064471245E-4,0,3.0512292604785735E-2,2.1733231083604018E-3,4.8055523442506957E-2,1.5275252316519487E-4,3.9949968710876894E-2,2.0816659994661333E-4,4.0509258201057968E-2,3.5118845842842505E-4,3.6528527664461782E-2,4.5092497528228934E-4,2.7024680078278331E-2,5.5075705472861034E-4,3.3471380810079068E-2,9.2915732431775658E-4,3.7004504230340157E-2,1.0503967504392475E-3,5.4601587278516099E-2,2.2810816147900842E-3,2.88675134594817E-2,1.5143755588800719E-3,4.0054130040898611E-2,3.0643106892089189E-3,3.1390019645315535E-2,3.3291640592396912E-3,8.5457591821909068E-2,2.5114935795259367E-2,{"$f":"IF(ISERROR(STDEV(AH7:AH9)),\"Not Calc\",STDEV(AH7:AH9))","v":"Not Calc"},"Not Calc",0,0,0,0,3.9949968710876894E-2,235.49142264040728,6.0504162206878346E-3,4.0509258201057968E-2,183.61755940988283,1.2107165034078171E-3,3.6528527664461789E-2,277.34788387674053,3.1473236885754896E-3,2.7024680078278331E-2,157.90244973613397,1.5206623260467917E-3,3.3471380810079068E-2,92.588477821005242,1.7242890674709856E-3,3.7004504230340157E-2,58.23068175214636,8.4150004863120715E-4,0,0,0,2.88675134594817E-2,16.378958277951721,3.155619921619932E-4,4.0054130040898611E-2,16.176664352358465,{"$f":"IF(ISERROR(STDEV(BN7:BN9)),\"Not Calc\",STDEV(BN7:BN9))","v":4.1063469999339235E-4},0,0,0,0,0,0,3.6594306868465251E-2,1.1253643276592142E-3,1.2910443235815907E-2,2.1077228768310681E-3,1.1486281688757434E-2,8.2340460247181584E-4,6.7177299468663366E-3,5.1452100083973062E-4,4.2777395908722782E-3,3.7178883220046296E-4,3.8627493620422455E-3,3.3814616028549522E-4,1.0163398433596316E-2,4.0651803123507168E-4,1.3040573188108957E-2,8.5582344933048072E-4,1.9049703151570692E-3,9.543303638305078E-4,3.5548079127369896E-2,2.2588650857763549E-3,2.0410902640776461E-2,1.4882374970134346E-3,3.0525258276752839E-2,2.9864324630416049E-3,2.73529776440045E-2,{"$f":"IF(ISERROR(STDEV(CT7:CT9)),\"Not Calc\",STDEV(CT7:CT9))","v":3.3236613932080229E-3},6.2345226940267104E-2,2.5109739620620079E-2,"Not Calc","Not Calc","Not Calc"]
[null,"Autosave Image -001V-DF.fit","2013-10-05","19:58:54",2456571.3325700001,{"$f":"E7-oJDOffset","v":3571.332570000086},60,18.356999999999999,7.3899999999999993E-2,14.957000000000001,4.1000000000000003E-3,15.64,6.8999999999999999E-3,16.081,9.9000000000000008E-3,16.445,1.35E-2,16.721,1.72E-2,17.209,2.64E-2,17.484999999999999,3.3599999999999998E-2,17.783000000000001,4.4400000000000002E-2,18.09,5.79E-2,18.343,7.3400000000000007E-2,18.716999999999999,0.1036,19.966000000000001,0.32390000000000002,"Blank","Blank",0,{"$f":"(Results!$F$14-$J7)*$AL$2","v":0},{"$f":"(1/SUMSQ(Results!$G$14,$K7))*$AL$2","v":0},{"$f":"$AL7/SUM($AL7,$AO7,$AR7,$AU7,$AX7,$BA7,$BD7,$BG7,$BJ7,$BM7,$BP7,$BS7)","v":0},{"$f":"(Results!$F$15-$L7)*$AO$2","v":-2.9750000000000014},{"$f":"(1/SUMSQ(Results!$G$15,$M7))*$AO$2","v":8959.7706298718749},{"$f":"$AO7/SUM($AL7,$AO7,$AR7,$AU7,$AX7,$BA7,$BD7,$BG7,$BJ7,$BM7,$BP7,$BS7)","v":0.37288400611563949},{"$f":"(Results!$F$16-$N7)*$AR$2","v":-2.9829999999999988},{"$f":"(1/SUMSQ(Results!$G$16,$O7))*$AR$2","v":5050.2499873743736},{"$f":"$AR7/SUM($AL7,$AO7,$AR7,$AU7,$AX7,$BA7,$BD7,$BG7,$BJ7,$BM7,$BP7,$BS7)","v":0.21017920267949353},{"$f":"(Results!$F$17-$P7)*$AU$2","v":-3.0060000000000002},{"$f":"(1/SUMSQ(Results!$G$17,$Q7))*$AU$2","v":4581.9014891179841},{"$f":"$AU7/SUM($AL7,$AO7,$AR7,$AU7,$AX7,$BA7,$BD7,$BG7,$BJ7,$BM7,$BP7,$BS7)","v":0.19068766974830023},{"$f":"(Results!$F$18-$R7)*$AX$2","v":-2.9809999999999999},{"$f":"(1/SUMSQ(Results!$G$18,$S7))*$AX$2","v":2779.0128946198311},{"$f":"$AX7/SUM($AL7,$AO7,$AR7,$AU7,$AX7,$BA7,$BD7,$BG7,$BJ7,$BM7,$BP7,$BS7)","v":0.11565580236373534},{"$f":"(Results!$F$19-$T7)*$BA$2","v":-2.9849999999999994},{"$f":"(1/SUMSQ(Results!$G$19,$U7))*$BA$2","v":1314.1295206055509},{"$f":"$BA7/SUM($AL7,$AO7,$AR7,$AU7,$AX7,$BA7,$BD7,$BG7,$BJ7,$BM7,$BP7,$BS7)","v":5.4690895608923623E-2},{"$f":"(Results!$F$20-$V7)*$BD$2","v":-2.9959999999999987},{"$f":"(1/SUMSQ(Results!$G$20,$W7))*$BD$2","v":866.58116399181961},{"$f":"$BD7/SUM($AL7,$AO7,$AR7,$AU7,$AX7,$BA7,$BD7,$BG7,$BJ7,$BM7,$BP7,$BS7)","v":3.6065014318144933E-2},{"$f":"(Results!$F$21-$X7)*$BG$2","v":0},{"$f":"(1/SUMSQ(Results!$G$21,$Y7))*$BG$2","v":0},{"$f":"$BG7/SUM($AL7,$AO7,$AR7,$AU7,$AX7,$BA7,$BD7,$BG7,$BJ7,$BM7,$BP7,$BS7)","v":0},{"$f":"(Results!$F$22-$Z7)*$BJ$2","v":-2.9779999999999998},{"$f":"(1/SUMSQ(Results!$G$22,$AA7))*$BJ$2","v":295.12367157457334},{"$f":"$BJ7/SUM($AL7,$AO7,$AR7,$AU7,$AX7,$BA7,$BD7,$BG7,$BJ7,$BM7,$BP7,$BS7)","v":1.2282334169290766E-2},{"$f":"(Results!$F$23-$AB7)*$BM$2","v":-2.9440000000000008},{"$f":"(1/SUMSQ(Results!$G$23,$AC7))*$BM$2","v":181.53564633951521},{"$f":"$BM7/SUM($AL7,$AO7,$AR7,$AU7,$AX7,$BA7,$BD7,$BG7,$BJ7,$BM7,$BP7,$BS7)","v":7.5550749964721307E-3},{"$f":"(Results!$F$24-$AD7)*$BP$2","v":0},{"$f":"(1/SUMSQ(Results!$G$24,$AE7))*$BP$2","v":0},{"$f":"$BP7/SUM($AL7,$AO7,$AR7,$AU7,$AX7,$BA7,$BD7,$BG7,$BJ7,$BM7,$BP7,$BS7)","v":0},{"$f":"(Results!$F$25-$AF7)*$BS$2","v":0},{"$f":"(1/SUMSQ(Results!$G$25,$AG7))*$BS$2","v":0},{"$f":"$BS7/SUM($AL7,$AO7,$AR7,$AU7,$AX7,$BA7,$BD7,$BG7,$BJ7,$BM7,$BP7,$BS7)","v":0},{"$f":"SUM($AK7*$AM7,$AN7*$AP7,$AQ7*$AS7,$AT7*$AV7,$AW7*$AY7,$AZ7*$BB7,$BC7*$BE7,$BF7*$BH7,$BI7*$BK7,$BL7*$BN7,$BO7*$BQ7,$BR7*$BT7)","v":-2.9843936001322038},{"$f":"IF($BV$2>1,SQRT(SUM((($AK7-$BU7)^2)*$AM7,(($AN7-$BU7)^2)*$AP7,(($AQ7-$BU7)^2)*$AS7,(($AT7-$BU7)^2)*$AV7,(($AW7-$BU7)^2)*$AY7,(($AZ7-$BU7)^2)*$BB7,(($BC7-$BU7)^2)*$BE7,(($BF7-$BU7)^2)*$BH7,(($BI7-$BU7)^2)*$BK7,(($BL7-$BU7)^2)*$BN7,(($BO7-$BU7)^2)*$BQ7,(($BR7-$BU7)^2)*$BT7)/(IF($BV$2=1,1,$BV$2-1))),1/SQRT(SUM($AL7,$AO7,$AR7,$AU7,$AX7,$BA7,$BD7,$BG7,$BJ7,$BM7,$BP7,$BS7)))","v":4.4939790513099636E-3},{"$f":"$H7+$BU7","v":15.372606399867795},{"$f":"SQRT(SUMSQ($I7,$BV7))","v":7.4036516987994599E-2},{"$f":"$J7+$BU7","v":11.972606399867797},{"$f":"SQRT(SUMSQ($K7,$BV7))","v":6.083243190405329E-3},{"$f":"$L7+$BU7","v":12.655606399867796},{"$f":"SQRT(SUMSQ($M7,$BV7))","v":8.2344306247373773E-3},{"$f":"$N7+$BU7","v":13.096606399867795},{"$f":"SQRT(SUMSQ($O7,$BV7))","v":1.0872251271637021E-2},{"$f":"$P7+$BU7","v":13.460606399867796},{"$f":"SQRT(SUMSQ($Q7,$BV7))","v":1.4228346626140817E-2},{"$f":"$R7+$BU7","v":13.736606399867796},{"$f":"SQRT(SUMSQ($S7,$BV7))","v":1.7777397101758536E-2},{"$f":"$T7+$BU7","v":14.224606399867795},{"$f":"SQRT(SUMSQ($U7,$BV7))","v":2.6779765639631962E-2},{"$f":"$V7+$BU7","v":14.500606399867795},{"$f":"SQRT(SUMSQ($W7,$BV7))","v":3.3899201284301857E-2},{"$f":"$X7+$BU7","v":14.798606399867797},{"$f":"SQRT(SUMSQ($Y7,$BV7))","v":4.4626851196489459E-2},{"$f":"$Z7+$BU7","v":15.105606399867796},{"$f":"SQRT(SUMSQ($AA7,$BV7))","v":5.8074140955451187E-2},{"$f":"$AB7+$BU7","v":15.358606399867796},{"$f":"SQRT(SUMSQ($AC7,$BV7))","v":7.3537445207959282E-2},{"$f":"$AD7+$BU7","v":15.732606399867795},{"$f":"SQRT(SUMSQ($AE7,$BV7))","v":0.10369742449894122},{"$f":"$AF7+$BU7","v":16.981606399867797},{"$f":"SQRT(SUMSQ($AG7,$BV7))","v":0.32393117455365983},{"$f":"IF(MOD(ROW($CW7)-7,oBlockAvg)=0,AVERAGE(INDIRECT(ADDRESS((INT((ROW($CW7)-7)/oBlockAvg)*oBlockAvg)+7,COLUMN(Calculation!JDGraph))&\":\"&ADDRESS(((INT((ROW($CW7)-7)/oBlockAvg)+1)*oBlockAvg)+6,COLUMN(Calculation!JDGraph)))),#N/A)","v":3571.3333000000566},{"$f":"IF(MOD(ROW($CX7)-7,oBlockAvg)=0,AVERAGE(INDIRECT(ADDRESS((INT((ROW($CX7)-7)/oBlockAvg)*oBlockAvg)+7,75)&\":\"&ADDRESS(((INT((ROW($CX7)-7)/oBlockAvg)+1)*oBlockAvg)+6,75))),#N/A)","v":15.386723833505906},{"$f":"IF(MOD(ROW($CY7)-7,oBlockAvg)=0,STDEV(INDIRECT(ADDRESS((INT((ROW($CY7)-7)/oBlockAvg)*oBlockAvg)+7,75)&\":\"&ADDRESS(((INT((ROW($CY7)-7)/oBlockAvg)+1)*oBlockAvg)+6,75)))/SQRT(COUNT(INDIRECT(ADDRESS((INT((ROW($CY7)-7)/oBlockAvg)*oBlockAvg)+7,75)&\":\"&ADDRESS(((INT((ROW($CY7)-7)/oBlockAvg)+1)*oBlockAvg)+6,75)))),#N/A)","v":7.4538478775556978E-3}]
[null,"Autosave Image -002V-DF.fit","2013-10-05","19:59:57",2456571.3333000001,{"$f":"E8-oJDOffset","v":3571.3333000000566},60,18.350000000000001,7.3099999999999998E-2,14.913,3.8999999999999998E-3,15.616,6.7999999999999996E-3,16.042000000000002,9.5999999999999992E-3,16.405999999999999,1.3100000000000001E-2,16.692,1.67E-2,17.16,2.5100000000000001E-2,17.449000000000002,3.2500000000000001E-2,17.683,4.0399999999999998E-2,18.04,5.5500000000000001E-2,18.370999999999999,7.4300000000000005E-2,18.657,9.7600000000000006E-2,19.809000000000001,0.28050000000000003,"Blank","Blank",0,{"$f":"(Results!$F$14-$J8)*$AL$2","v":0},{"$f":"(1/SUMSQ(Results!$G$14,$K8))*$AL$2","v":0},{"$f":"$AL8/SUM($AL8,$AO8,$AR8,$AU8,$AX8,$BA8,$BD8,$BG8,$BJ8,$BM8,$BP8,$BS8)","v":0},{"$f":"(Results!$F$15-$L8)*$AO$2","v":-2.9510000000000005},{"$f":"(1/SUMSQ(Results!$G$15,$M8))*$AO$2","v":9071.117561683599},{"$f":"$AO8/SUM($AL8,$AO8,$AR8,$AU8,$AX8,$BA8,$BD8,$BG8,$BJ8,$BM8,$BP8,$BS8)","v":0.36470999501762913},{"$f":"(Results!$F$16-$N8)*$AR$2","v":-2.9440000000000008},{"$f":"(1/SUMSQ(Results!$G$16,$O8))*$AR$2","v":5203.9966694421319},{"$f":"$AR8/SUM($AL8,$AO8,$AR8,$AU8,$AX8,$BA8,$BD8,$BG8,$BJ8,$BM8,$BP8,$BS8)","v":0.20922996383609202},{"$f":"(Results!$F$17-$P8)*$AU$2","v":-2.9669999999999987},{"$f":"(1/SUMSQ(Results!$G$17,$Q8))*$AU$2","v":4816.7236645633629},{"$f":"$AU8/SUM($AL8,$AO8,$AR8,$AU8,$AX8,$BA8,$BD8,$BG8,$BJ8,$BM8,$BP8,$BS8)","v":0.19365940875075108},{"$f":"(Results!$F$18-$R8)*$AX$2","v":-2.952},{"$f":"(1/SUMSQ(Results!$G$18,$S8))*$AX$2","v":2916.3871795619589},{"$f":"$AX8/SUM($AL8,$AO8,$AR8,$AU8,$AX8,$BA8,$BD8,$BG8,$BJ8,$BM8,$BP8,$BS8)","v":0.11725518344292175},{"$f":"(Results!$F$19-$T8)*$BA$2","v":-2.9359999999999999},{"$f":"(1/SUMSQ(Results!$G$19,$U8))*$BA$2","v":1440.9014279333148},{"$f":"$BA8/SUM($AL8,$AO8,$AR8,$AU8,$AX8,$BA8,$BD8,$BG8,$BJ8,$BM8,$BP8,$BS8)","v":5.7932349462894529E-2},{"$f":"(Results!$F$20-$V8)*$BD$2","v":-2.9600000000000009},{"$f":"(1/SUMSQ(Results!$G$20,$W8))*$BD$2","v":924.85549132947961},{"$f":"$BD8/SUM($AL8,$AO8,$AR8,$AU8,$AX8,$BA8,$BD8,$BG8,$BJ8,$BM8,$BP8,$BS8)","v":3.7184397549820516E-2},{"$f":"(Results!$F$21-$X8)*$BG$2","v":0},{"$f":"(1/SUMSQ(Results!$G$21,$Y8))*$BG$2","v":0},{"$f":"$BG8/SUM($AL8,$AO8,$AR8,$AU8,$AX8,$BA8,$BD8,$BG8,$BJ8,$BM8,$BP8,$BS8)","v":0},{"$f":"(Results!$F$22-$Z8)*$BJ$2","v":-2.927999999999999},{"$f":"(1/SUMSQ(Results!$G$22,$AA8))*$BJ$2","v":320.89851584436423},{"$f":"$BJ8/SUM($AL8,$AO8,$AR8,$AU8,$AX8,$BA8,$BD8,$BG8,$BJ8,$BM8,$BP8,$BS8)","v":1.2901926947691437E-2},{"$f":"(Results!$F$23-$AB8)*$BM$2","v":-2.9719999999999995},{"$f":"(1/SUMSQ(Results!$G$23,$AC8))*$BM$2","v":177.25813570528351},{"$f":"$BM8/SUM($AL8,$AO8,$AR8,$AU8,$AX8,$BA8,$BD8,$BG8,$BJ8,$BM8,$BP8,$BS8)","v":7.1267749921994777E-3},{"$f":"(Results!$F$24-$AD8)*$BP$2","v":0},{"$f":"(1/SUMSQ(Results!$G$24,$AE8))*$BP$2","v":0},{"$f":"$BP8/SUM($AL8,$AO8,$AR8,$AU8,$AX8,$BA8,$BD8,$BG8,$BJ8,$BM8,$BP8,$BS8)","v":0},{"$f":"(Results!$F$25-$AF8)*$BS$2","v":0},{"$f":"(1/SUMSQ(Results!$G$25,$AG8))*$BS$2","v":0},{"$f":"$BS8/SUM($AL8,$AO8,$AR8,$AU8,$AX8,$BA8,$BD8,$BG8,$BJ8,$BM8,$BP8,$BS8)","v":0},{"$f":"SUM($AK8*$AM8,$AN8*$AP8,$AQ8*$AS8,$AT8*$AV8,$AW8*$AY8,$AZ8*$BB8,$BC8*$BE8,$BF8*$BH8,$BI8*$BK8,$BL8*$BN8,$BO8*$BQ8,$BR8*$BT8)","v":-2.9520697882676461},{"$f":"IF($BV$2>1,SQRT(SUM((($AK8-$BU8)^2)*$AM8,(($AN8-$BU8)^2)*$AP8,(($AQ8-$BU8)^2)*$AS8,(($AT8-$BU8)^2)*$AV8,(($AW8-$BU8)^2)*$AY8,(($AZ8-$BU8)^2)*$BB8,(($BC8-$BU8)^2)*$BE8,(($BF8-$BU8)^2)*$BH8,(($BI8-$BU8)^2)*$BK8,(($BL8-$BU8)^2)*$BN8,(($BO8-$BU8)^2)*$BQ8,(($BR8-$BU8)^2)*$BT8)/(IF($BV$2=1,1,$BV$2-1))),1/SQRT(SUM($AL8,$AO8,$AR8,$AU8,$AX8,$BA8,$BD8,$BG8,$BJ8,$BM8,$BP8,$BS8)))","v":3.4808994541964413E-3},{"$f":"$H8+$BU8","v":15.397930211732355},{"$f":"SQRT(SUMSQ($I8,$BV8))","v":7.3182830370314492E-2},{"$f":"$J8+$BU8","v":11.960930211732354},{"$f":"SQRT(SUMSQ($K8,$BV8))","v":5.2274908904966135E-3},{"$f":"$L8+$BU8","v":12.663930211732353},{"$f":"SQRT(SUMSQ($M8,$BV8))","v":7.6391531605424093E-3},{"$f":"$N8+$BU8","v":13.089930211732355},{"$f":"SQRT(SUMSQ($O8,$BV8))","v":1.0211594440156006E-2},{"$f":"$P8+$BU8","v":13.453930211732352},{"$f":"SQRT(SUMSQ($Q8,$BV8))","v":1.3554580812781526E-2},{"$f":"$R8+$BU8","v":13.739930211732354},{"$f":"SQRT(SUMSQ($S8,$BV8))","v":1.705891734578209E-2},{"$f":"$T8+$BU8","v":14.207930211732354},{"$f":"SQRT(SUMSQ($U8,$BV8))","v":2.534021825103772E-2},{"$f":"$V8+$BU8","v":14.496930211732355},{"$f":"SQRT(SUMSQ($W8,$BV8))","v":3.2685878617687868E-2},{"$f":"$X8+$BU8","v":14.730930211732353},{"$f":"SQRT(SUMSQ($Y8,$BV8))","v":4.0549681392215958E-2},{"$f":"$Z8+$BU8","v":15.087930211732353},{"$f":"SQRT(SUMSQ($AA8,$BV8))","v":5.5609051970072508E-2},{"$f":"$AB8+$BU8","v":15.418930211732352},{"$f":"SQRT(SUMSQ($AC8,$BV8))","v":7.438149407621647E-2},{"$f":"$AD8+$BU8","v":15.704930211732353},{"$f":"SQRT(SUMSQ($AE8,$BV8))","v":9.7662053331937615E-2},{"$f":"$AF8+$BU8","v":16.856930211732355},{"$f":"SQRT(SUMSQ($AG8,$BV8))","v":0.28052159749475664},{"$f":"IF(MOD(ROW($CW8)-7,oBlockAvg)=0,AVERAGE(INDIRECT(ADDRESS((INT((ROW($CW8)-7)/oBlockAvg)*oBlockAvg)+7,COLUMN(Calculation!JDGraph))&\":\"&ADDRESS(((INT((ROW($CW8)-7)/oBlockAvg)+1)*oBlockAvg)+6,COLUMN(Calculation!JDGraph)))),#N/A)","v":{"$error":"#N/A"}},{"$f":"IF(MOD(ROW($CX8)-7,oBlockAvg)=0,AVERAGE(INDIRECT(ADDRESS((INT((ROW($CX8)-7)/oBlockAvg)*oBlockAvg)+7,75)&\":\"&ADDRESS(((INT((ROW($CX8)-7)/oBlockAvg)+1)*oBlockAvg)+6,75))),#N/A)","v":{"$error":"#N/A"}},{"$f":"IF(MOD(ROW($CY8)-7,oBlockAvg)=0,STDEV(INDIRECT(ADDRESS((INT((ROW($CY8)-7)/oBlockAvg)*oBlockAvg)+7,75)&\":\"&ADDRESS(((INT((ROW($CY8)-7)/oBlockAvg)+1)*oBlockAvg)+6,75)))/SQRT(COUNT(INDIRECT(ADDRESS((INT((ROW($CY8)-7)/oBlockAvg)*oBlockAvg)+7,75)&\":\"&ADDRESS(((INT((ROW($CY8)-7)/oBlockAvg)+1)*oBlockAvg)+6,75)))),#N/A)","v":{"$error":"#N/A"}}]
[null,"Autosave Image -003V-DF.fit","2013-10-05","20:01:00",2456571.33403,{"$f":"E9-oJDOffset","v":3571.3340300000273},60,18.300999999999998,6.9800000000000001E-2,14.861000000000001,3.8E-3,15.561999999999999,6.4999999999999997E-3,16,9.1999999999999998E-3,16.372,1.26E-2,16.667000000000002,1.61E-2,17.145,2.46E-2,17.411000000000001,3.15E-2,17.695,4.0500000000000001E-2,18.04,5.5100000000000003E-2,18.292000000000002,6.8599999999999994E-2,18.670999999999999,9.8100000000000007E-2,19.829000000000001,0.28029999999999999,"Blank","Blank",0,{"$f":"(Results!$F$14-$J9)*$AL$2","v":0},{"$f":"(1/SUMSQ(Results!$G$14,$K9))*$AL$2","v":0},0,{"$f":"(Results!$F$15-$L9)*$AO$2","v":-2.8970000000000002},{"$f":"(1/SUMSQ(Results!$G$15,$M9))*$AO$2","v":9411.7647058823532},0.36106966168071181,{"$f":"(Results!$F$16-$N9)*$AR$2","v":-2.9019999999999992},{"$f":"(1/SUMSQ(Results!$G$16,$O9))*$AR$2","v":5415.9445407279027},0.20777540919397544,{"$f":"(Results!$F$17-$P9)*$AU$2","v":-2.9329999999999998},{"$f":"(1/SUMSQ(Results!$G$17,$Q9))*$AU$2","v":5134.5245430273153},0.19697911046198205,{"$f":"(Results!$F$18-$R9)*$AX$2","v":-2.9270000000000014},{"$f":"(1/SUMSQ(Results!$G$18,$S9))*$AX$2","v":3093.9636768664336},0.11869574441872352,{"$f":"(Results!$F$19-$T9)*$BA$2","v":-2.9209999999999994},{"$f":"(1/SUMSQ(Results!$G$19,$U9))*$BA$2","v":1494.4109032219499},5.7331059169071115E-2,{"$f":"(Results!$F$20-$V9)*$BD$2","v":-2.9220000000000006},{"$f":"(1/SUMSQ(Results!$G$20,$W9))*$BD$2","v":983.04251658884232},3.7713100568764438E-2,{"$f":"(Results!$F$21-$X9)*$BG$2","v":0},{"$f":"(1/SUMSQ(Results!$G$21,$Y9))*$BG$2","v":0},0,{"$f":"(Results!$F$22-$Z9)*$BJ$2","v":-2.927999999999999},{"$f":"(1/SUMSQ(Results!$G$22,$AA9))*$BJ$2","v":325.5197736986533},1.2488127171973928E-2,{"$f":"(Results!$F$23-$AB9)*$BM$2","v":-2.8930000000000025},{"$f":"(1/SUMSQ(Results!$G$23,$AC9))*$BM$2","v":207.1697300164079},7.9477873347978106E-3,{"$f":"(Results!$F$24-$AD9)*$BP$2","v":0},{"$f":"(1/SUMSQ(Results!$G$24,$AE9))*$BP$2","v":0},0,{"$f":"(Results!$F$25-$AF9)*$BS$2","v":0},{"$f":"(1/SUMSQ(Results!$G$25,$AG9))*$BS$2","v":0},0,-2.9113651110824321,5.7280101094947062E-3,15.389634888917566,7.0034635001650969E-2,11.949634888917569,6.8738708028645368E-3,12.650634888917567,8.6637232074018595E-3,13.088634888917568,1.083743972599034E-2,13.460634888917568,1.3840885080603537E-2,13.755634888917569,1.7088595606850599E-2,14.233634888917567,2.5258069993854906E-2,14.499634888917569,3.2016559774817682E-2,14.783634888917568,4.09030573406741E-2,15.128634888917567,5.5396932223855805E-2,15.380634888917569,6.8838725291905808E-2,15.759634888917567,9.8267085536381277E-2,16.917634888917569,0.28035852064778494,{"$f":"IF(MOD(ROW($CW9)-7,oBlockAvg)=0,AVERAGE(INDIRECT(ADDRESS((INT((ROW($CW9)-7)/oBlockAvg)*oBlockAvg)+7,COLUMN(Calculation!JDGraph))&\":\"&ADDRESS(((INT((ROW($CW9)-7)/oBlockAvg)+1)*oBlockAvg)+6,COLUMN(Calculation!JDGraph)))),#N/A)","v":{"$error":"#N/A"}},{"$f":"IF(MOD(ROW($CX9)-7,oBlockAvg)=0,AVERAGE(INDIRECT(ADDRESS((INT((ROW($CX9)-7)/oBlockAvg)*oBlockAvg)+7,75)&\":\"&ADDRESS(((INT((ROW($CX9)-7)/oBlockAvg)+1)*oBlockAvg)+6,75))),#N/A)","v":{"$error":"#N/A"}},{"$f":"IF(MOD(ROW($CY9)-7,oBlockAvg)=0,STDEV(INDIRECT(ADDRESS((INT((ROW($CY9)-7)/oBlockAvg)*oBlockAvg)+7,75)&\":\"&ADDRESS(((INT((ROW($CY9)-7)/oBlockAvg)+1)*oBlockAvg)+6,75)))/SQRT(COUNT(INDIRECT(ADDRESS((INT((ROW($CY9)-7)/oBlockAvg)*oBlockAvg)+7,75)&\":\"&ADDRESS(((INT((ROW($CY9)-7)/oBlockAvg)+1)*oBlockAvg)+6,75)))),#N/A)","v":{"$error":"#N/A"}}]

{"sheet":"CalcAAVSO","index":4,"n_rows":9,"n_cols":103,"rows_kept":9,"cut":false,"hidden":false,"merged":[[0,100,0,102],[0,33,0,36],[0,72,0,73],[0,74,0,77]]}
[null,"Image Data",null,null,null,null,null,null,null,null,null,null,null,null,null,null,null,null,null,null,null,null,null,null,null,null,null,null,null,null,null,null,null,"Intermediate Calculations",null,null,null,null,null,null,null,null,null,null,null,null,null,null,null,null,null,null,null,null,null,null,null,null,null,null,null,null,null,null,null,null,null,null,null,null,null,null,"Zero Point Calculations",null,"Final Derived Calculations",null,null,null,null,null,null,null,null,null,null,null,null,null,null,null,null,null,null,null,null,null,null,null,null,null,"Block Average Calculations"]
[null,null,null,null,null,null,null,null,null,null,null,null,null,null,null,null,null,null,null,null,null,null,null,null,null,null,null,null,null,null,null,null,null,null,null,null,"Include",{"$f":"IF(Results!$E$14=\"Yes\",1,0)","v":0},null,"Include",{"$f":"IF(Results!$E$15=\"Yes\",1,0)","v":1},null,"Include",{"$f":"IF(Results!$E$16=\"Yes\",1,0)","v":1},null,"Include",{"$f":"IF(Results!$E$17=\"Yes\",1,0)","v":1},null,"Include",{"$f":"IF(Results!$E$18=\"Yes\",1,0)","v":1},null,"Include",{"$f":"IF(Results!$E$19=\"Yes\",1,0)","v":1},null,"Include",{"$f":"IF(Results!$E$20=\"Yes\",1,0)","v":1},null,"Include",{"$f":"IF(Results!$E$21=\"Yes\",1,0)","v":0},null,"Include",{"$f":"IF(Results!$E$22=\"Yes\",1,0)","v":1},null,"Include",{"$f":"IF(Results!$E$23=\"Yes\",1,0)","v":0},null,"Include",{"$f":"IF(Results!$E$24=\"Yes\",1,0)","v":0},null,"Include",{"$f":"IF(Results!$E$25=\"Yes\",1,0)","v":0},null,"Comparisons",{"$f":"SUM($AH$2:$BT$2)","v":7}]
[null,null,null,null,null,null,"Exposure","Var",null,"C1",null,"C2",null,"C3",null,"C4",null,"C5",null,"C6",null,"C7",null,"C8",null,"C9",null,"C10",null,"C11",null,"C12",null,"Var",null,null,"C1",null,null,"C2",null,null,"C3",null,null,"C4",null,null,"C5",null,null,"C6",null,null,"C7",null,null,"C8",null,null,"C9",null,null,"C10",null,null,"C11",null,null,"C12",null,null,null,null,"Var",null,"C1",null,"C2",null,"C3",null,"C4",null,"C5",null,"C6",null,"C7",null,"C8",null,"C9",null,"C10",null,"C11",null,"C12",null,"Var"]
[null,"Image Name","Date","Time","Julian Date",{"$f":"\"JD-\"&oJDOffset","v":"JD-2453000"},"Length","InstMag","Error","InstMag","Error","InstMag","Error","InstMag","Error","InstMag","Error","InstMag","Error","InstMag","Error","InstMag","Error","InstMag","Error","InstMag","Error","InstMag","Error","InstMag","Error","InstMag","Error","Magnitude","1/SumSqErr","Weight","Magnitude","1/SumSqErr","Weight","Magnitude","1/SumSqErr","Weight","Magnitude","1/SumSqErr","Weight","Magnitude","1/SumSqErr","Weight","Magnitude","1/SumSqErr","Weight","Magnitude","1/SumSqErr","Weight","Magnitude","1/SumSqErr","Weight","Magnitude","1/SumSqErr","Weight","Magnitude","1/SumSqErr","Weight","Magnitude","1/SumSqErr","Weight","Magnitude","1/SumSqErr","Weight","Magnitude","1/SumSqErr","Weight","Wt Mean ZP Mag","Wt ZP Std Err","Magnitude","Error","Magnitude","Error","Magnitude","Error","Magnitude","Error","Magnitude","Error","Magnitude","Error","Magnitude","Error","Magnitude","Error","Magnitude","Error","Magnitude","Error","Magnitude","Error","Magnitude","Error","Magnitude","Error","Julian Date","Magnitude","Error"]
["Mean",{"$f":"IF(ISERROR(AVERAGE(B7:B9)),\"Not Calc\",AVERAGE(B7:B9))","v":"Not Calc"},"2013-10-05","19:59:57",2456571.3333000001,3571.3333000000566,60,18.335999999999999,7.226666666666666E-2,14.910333333333334,3.933333333333333E-3,15.606,6.7333333333333334E-3,16.041,9.566666666666666E-3,16.407666666666668,1.3066666666666666E-2,16.693333333333332,1.6666666666666666E-2,17.171333333333333,2.5366666666666666E-2,17.448333333333334,3.2533333333333331E-2,17.720333333333333,4.1766666666666667E-2,18.056666666666665,5.616666666666667E-2,18.335333333333335,7.2099999999999997E-2,18.681666666666665,9.976666666666667E-2,19.868000000000002,0.2949,"Not Calc","Not Calc",0,0,0,0,-2.9410000000000007,9147.5509658126084,0.36900427792680324,-2.9429999999999996,5223.3970658481367,0.21065033539781242,-2.9686666666666661,4844.3832322362205,0.19524865997892779,-2.9533333333333336,2929.7879170160745,0.11809324870895017,-2.9473333333333329,1416.4806172536053,5.7081927813156359E-2,-2.9593333333333334,924.82639063671377,3.7268701533664392E-2,0,0,0,-2.9446666666666661,313.84732037253031,1.2652848640685598E-2,0,0,{"$f":"IF(ISERROR(AVERAGE(BN7:BN9)),\"Not Calc\",AVERAGE(BN7:BN9))","v":0},0,0,0,0,0,0,-2.9493800243456119,4.8459575204165247E-3,15.386619975654389,7.2437678638041583E-2,11.960953308987721,6.2783055204433296E-3,12.656619975654388,8.3446764463567923E-3,13.091619975654389,1.0770356860073967E-2,13.458286642321054,1.3975452720958834E-2,13.743953308987722,1.7389655235337812E-2,14.221953308987722,2.5847595999695262E-2,14.498953308987723,3.2910420835547488E-2,14.770953308987721,4.2060392275588221E-2,15.107286642321055,5.6385153100420422E-2,15.385953308987721,7.2272421215265767E-2,15.732286642321055,9.9889692831932567E-2,16.918619975654391,0.29494198738240263,"Not Calc","Not Calc","Not Calc"]
["StDev",{"$f":"IF(ISERROR(STDEV(B7:B9)),\"Not Calc\",STDEV(B7:B9))","v":"Not Calc"},"00:00:00","00:01:03",7.2999997064471245E-4,7.2999997064471245E-4,0,3.0512292604785735E-2,2.1733231083604018E-3,4.8055523442506957E-2,1.5275252316519487E-4,3.9949968710876894E-2,2.0816659994661333E-4,4.0509258201057968E-2,3.5118845842842505E-4,3.6528527664461782E-2,4.5092497528228934E-4,2.7024680078278331E-2,5.5075705472861034E-4,3.3471380810079068E-2,9.2915732431775658E-4,3.7004504230340157E-2,1.0503967504392475E-3,5.4601587278516099E-2,2.2810816147900842E-3,2.88675134594817E-2,1.5143755588800719E-3,4.0054130040898611E-2,3.0643106892089189E-3,3.1390019645315535E-2,3.3291640592396912E-3,8.5457591821909068E-2,2.5114935795259367E-2,"Not Calc","Not Calc",0,0,0,0,3.9949968710876894E-2,235.49142264040728,6.0567091674529061E-3,4.0509258201057968E-2,183.61755940988283,1.1717343474668396E-3,3.6528527664461789E-2,277.34788387674053,3.2135848711737133E-3,2.7024680078278331E-2,157.90244973613397,1.555217246693198E-3,3.3471380810079068E-2,92.588477821005242,1.7327289518630461E-3,3.7004504230340157E-2,58.23068175214636,8.5263105036931654E-4,0,0,0,2.88675134594817E-2,16.378958277951721,3.1438015706040218E-4,0,0,{"$f":"IF(ISERROR(STDEV(BN7:BN9)),\"Not Calc\",STDEV(BN7:BN9))","v":0},0,0,0,0,0,0,3.6660830620403144E-2,1.2440805685130041E-3,1.3124315573513562E-2,2.0920715076679112E-3,1.1406044357441462E-2,9.364894999037886E-4,6.8884297010443898E-3,6.1012736694980596E-4,4.1288874735365974E-3,4.2049085062620807E-4,3.6501096256598368E-3,3.3581953760970817E-4,1.0165829717649564E-2,3.7753024992219215E-4,1.2868581888826908E-2,8.3088173062119224E-4,1.6779152658501523E-3,9.268190417855511E-4,3.53221694255502E-2,2.2456169154449657E-3,2.0280435218125299E-2,1.4762986346596194E-3,3.0753620655549534E-2,2.9704192330841867E-3,2.7207246143282179E-2,3.3183718611262398E-3,6.2120554269496371E-2,2.5107445335467129E-2,"Not Calc","Not Calc","Not Calc"]
[null,"Autosave Image -001V-DF.fit","2013-10-05","19:58:54",2456571.3325700001,{"$f":"E7-oJDOffset","v":3571.332570000086},60,18.356999999999999,7.3899999999999993E-2,14.957000000000001,4.1000000000000003E-3,15.64,6.8999999999999999E-3,16.081,9.9000000000000008E-3,16.445,1.35E-2,16.721,1.72E-2,17.209,2.64E-2,17.484999999999999,3.3599999999999998E-2,17.783000000000001,4.4400000000000002E-2,18.09,5.79E-2,18.343,7.3400000000000007E-2,18.716999999999999,0.1036,19.966000000000001,0.32390000000000002,"Blank","Blank",0,{"$f":"(Results!$F$14-$J7)*$AL$2","v":0},{"$f":"(1/SUMSQ(Results!$G$14,$K7))*$AL$2","v":0},{"$f":"$AL7/SUM($AL7,$AO7,$AR7,$AU7,$AX7,$BA7,$BD7,$BG7,$BJ7,$BM7,$BP7,$BS7)","v":0},{"$f":"(Results!$F$15-$L7)*$AO$2","v":-2.9750000000000014},{"$f":"(1/SUMSQ(Results!$G$15,$M7))*$AO$2","v":8959.7706298718749},{"$f":"$AO7/SUM($AL7,$AO7,$AR7,$AU7,$AX7,$BA7,$BD7,$BG7,$BJ7,$BM7,$BP7,$BS7)","v":0.37572261867761975},{"$f":"(Results!$F$16-$N7)*$AR$2","v":-2.9829999999999988},{"$f":"(1/SUMSQ(Results!$G$16,$O7))*$AR$2","v":5050.2499873743736},{"$f":"$AR7/SUM($AL7,$AO7,$AR7,$AU7,$AX7,$BA7,$BD7,$BG7,$BJ7,$BM7,$BP7,$BS7)","v":0.21177921049749573},{"$f":"(Results!$F$17-$P7)*$AU$2","v":-3.0060000000000002},{"$f":"(1/SUMSQ(Results!$G$17,$Q7))*$AU$2","v":4581.9014891179841},{"$f":"$AU7/SUM($AL7,$AO7,$AR7,$AU7,$AX7,$BA7,$BD7,$BG7,$BJ7,$BM7,$BP7,$BS7)","v":0.19213929654345541},{"$f":"(Results!$F$18-$R7)*$AX$2","v":-2.9809999999999999},{"$f":"(1/SUMSQ(Results!$G$18,$S7))*$AX$2","v":2779.0128946198311},{"$f":"$AX7/SUM($AL7,$AO7,$AR7,$AU7,$AX7,$BA7,$BD7,$BG7,$BJ7,$BM7,$BP7,$BS7)","v":0.11653624241498761},{"$f":"(Results!$F$19-$T7)*$BA$2","v":-2.9849999999999994},{"$f":"(1/SUMSQ(Results!$G$19,$U7))*$BA$2","v":1314.1295206055509},{"$f":"$BA7/SUM($AL7,$AO7,$AR7,$AU7,$AX7,$BA7,$BD7,$BG7,$BJ7,$BM7,$BP7,$BS7)","v":5.51072349014523E-2},{"$f":"(Results!$F$20-$V7)*$BD$2","v":-2.9959999999999987},{"$f":"(1/SUMSQ(Results!$G$20,$W7))*$BD$2","v":866.58116399181961},{"$f":"$BD7/SUM($AL7,$AO7,$AR7,$AU7,$AX7,$BA7,$BD7,$BG7,$BJ7,$BM7,$BP7,$BS7)","v":3.6339562437700743E-2},{"$f":"(Results!$F$21-$X7)*$BG$2","v":0},{"$f":"(1/SUMSQ(Results!$G$21,$Y7))*$BG$2","v":0},{"$f":"$BG7/SUM($AL7,$AO7,$AR7,$AU7,$AX7,$BA7,$BD7,$BG7,$BJ7,$BM7,$BP7,$BS7)","v":0},{"$f":"(Results!$F$22-$Z7)*$BJ$2","v":-2.9779999999999998},{"$f":"(1/SUMSQ(Results!$G$22,$AA7))*$BJ$2","v":295.12367157457334},{"$f":"$BJ7/SUM($AL7,$AO7,$AR7,$AU7,$AX7,$BA7,$BD7,$BG7,$BJ7,$BM7,$BP7,$BS7)","v":1.2375834527288358E-2},{"$f":"(Results!$F$23-$AB7)*$BM$2","v":0},{"$f":"(1/SUMSQ(Results!$G$23,$AC7))*$BM$2","v":0},{"$f":"$BM7/SUM($AL7,$AO7,$AR7,$AU7,$AX7,$BA7,$BD7,$BG7,$BJ7,$BM7,$BP7,$BS7)","v":0},{"$f":"(Results!$F$24-$AD7)*$BP$2","v":0},{"$f":"(1/SUMSQ(Results!$G$24,$AE7))*$BP$2","v":0},{"$f":"$BP7/SUM($AL7,$AO7,$AR7,$AU7,$AX7,$BA7,$BD7,$BG7,$BJ7,$BM7,$BP7,$BS7)","v":0},{"$f":"(Results!$F$25-$AF7)*$BS$2","v":0},{"$f":"(1/SUMSQ(Results!$G$25,$AG7))*$BS$2","v":0},{"$f":"$BS7/SUM($AL7,$AO7,$AR7,$AU7,$AX7,$BA7,$BD7,$BG7,$BJ7,$BM7,$BP7,$BS7)","v":0},{"$f":"SUM($AK7*$AM7,$AN7*$AP7,$AQ7*$AS7,$AT7*$AV7,$AW7*$AY7,$AZ7*$BB7,$BC7*$BE7,$BF7*$BH7,$BI7*$BK7,$BL7*$BN7,$BO7*$BQ7,$BR7*$BT7)","v":-2.9847010999951049},{"$f":"IF($BV$2>1,SQRT(SUM((($AK7-$BU7)^2)*$AM7,(($AN7-$BU7)^2)*$AP7,(($AQ7-$BU7)^2)*$AS7,(($AT7-$BU7)^2)*$AV7,(($AW7-$BU7)^2)*$AY7,(($AZ7-$BU7)^2)*$BB7,(($BC7-$BU7)^2)*$BE7,(($BF7-$BU7)^2)*$BH7,(($BI7-$BU7)^2)*$BK7,(($BL7-$BU7)^2)*$BN7,(($BO7-$BU7)^2)*$BQ7,(($BR7-$BU7)^2)*$BT7)/(IF($BV$2=1,1,$BV$2-1))),1/SQRT(SUM($AL7,$AO7,$AR7,$AU7,$AX7,$BA7,$BD7,$BG7,$BJ7,$BM7,$BP7,$BS7)))","v":4.6535210700772911E-3},{"$f":"$H7+$BU7","v":15.372298900004894},{"$f":"SQRT(SUMSQ($I7,$BV7))","v":7.4046372351045345E-2},{"$f":"$J7+$BU7","v":11.972298900004896},{"$f":"SQRT(SUMSQ($K7,$BV7))","v":6.2020366291770075E-3},{"$f":"$L7+$BU7","v":12.655298900004896},{"$f":"SQRT(SUMSQ($M7,$BV7))","v":8.3225752234301429E-3},{"$f":"$N7+$BU7","v":13.096298900004895},{"$f":"SQRT(SUMSQ($O7,$BV7))","v":1.0939161684043861E-2},{"$f":"$P7+$BU7","v":13.460298900004895},{"$f":"SQRT(SUMSQ($Q7,$BV7))","v":1.4279539850767367E-2},{"$f":"$R7+$BU7","v":13.736298900004895},{"$f":"SQRT(SUMSQ($S7,$BV7))","v":1.7818396626791459E-2},{"$f":"$T7+$BU7","v":14.224298900004895},{"$f":"SQRT(SUMSQ($U7,$BV7))","v":2.6807000174388279E-2},{"$f":"$V7+$BU7","v":14.500298900004895},{"$f":"SQRT(SUMSQ($W7,$BV7))","v":3.3920720192083968E-2},{"$f":"$X7+$BU7","v":14.798298900004896},{"$f":"SQRT(SUMSQ($Y7,$BV7))","v":4.4643199463632238E-2},{"$f":"$Z7+$BU7","v":15.105298900004895},{"$f":"SQRT(SUMSQ($AA7,$BV7))","v":5.8086704660788371E-2},{"$f":"$AB7+$BU7","v":15.358298900004895},{"$f":"SQRT(SUMSQ($AC7,$BV7))","v":7.3547367446766265E-2},{"$f":"$AD7+$BU7","v":15.732298900004894},{"$f":"SQRT(SUMSQ($AE7,$BV7))","v":0.10370446113041451},{"$f":"$AF7+$BU7","v":16.981298900004894},{"$f":"SQRT(SUMSQ($AG7,$BV7))","v":0.32393342720125329},{"$f":"IF(MOD(ROW($CW7)-7,oBlockAvg)=0,AVERAGE(INDIRECT(ADDRESS((INT((ROW($CW7)-7)/oBlockAvg)*oBlockAvg)+7,COLUMN(Calculation!JDGraph))&\":\"&ADDRESS(((INT((ROW($CW7)-7)/oBlockAvg)+1)*oBlockAvg)+6,COLUMN(Calculation!JDGraph)))),#N/A)","v":3571.3333000000566},{"$f":"IF(MOD(ROW($CX7)-7,oBlockAvg)=0,AVERAGE(INDIRECT(ADDRESS((INT((ROW($CX7)-7)/oBlockAvg)*oBlockAvg)+7,75)&\":\"&ADDRESS(((INT((ROW($CX7)-7)/oBlockAvg)+1)*oBlockAvg)+6,75))),#N/A)","v":15.386619975654389},{"$f":"IF(MOD(ROW($CY7)-7,oBlockAvg)=0,STDEV(INDIRECT(ADDRESS((INT((ROW($CY7)-7)/oBlockAvg)*oBlockAvg)+7,75)&\":\"&ADDRESS(((INT((ROW($CY7)-7)/oBlockAvg)+1)*oBlockAvg)+6,75)))/SQRT(COUNT(INDIRECT(ADDRESS((INT((ROW($CY7)-7)/oBlockAvg)*oBlockAvg)+7,75)&\":\"&ADDRESS(((INT((ROW($CY7)-7)/oBlockAvg)+1)*oBlockAvg)+6,75)))),#N/A)","v":7.5773271292976533E-3}]
[null,"Autosave Image -002V-DF.fit","2013-10-05","19:59:57",2456571.3333000001,{"$f":"E8-oJDOffset","v":3571.3333000000566},60,18.350000000000001,7.3099999999999998E-2,14.913,3.8999999999999998E-3,15.616,6.7999999999999996E-3,16.042000000000002,9.5999999999999992E-3,16.405999999999999,1.3100000000000001E-2,16.692,1.67E-2,17.16,2.5100000000000001E-2,17.449000000000002,3.2500000000000001E-2,17.683,4.0399999999999998E-2,18.04,5.5500000000000001E-2,18.370999999999999,7.4300000000000005E-2,18.657,9.7600000000000006E-2,19.809000000000001,0.28050000000000003,"Blank","Blank",0,{"$f":"(Results!$F$14-$J8)*$AL$2","v":0},{"$f":"(1/SUMSQ(Results!$G$14,$K8))*$AL$2","v":0},{"$f":"$AL8/SUM($AL8,$AO8,$AR8,$AU8,$AX8,$BA8,$BD8,$BG8,$BJ8,$BM8,$BP8,$BS8)","v":0},{"$f":"(Results!$F$15-$L8)*$AO$2","v":-2.9510000000000005},{"$f":"(1/SUMSQ(Results!$G$15,$M8))*$AO$2","v":9071.117561683599},{"$f":"$AO8/SUM($AL8,$AO8,$AR8,$AU8,$AX8,$BA8,$BD8,$BG8,$BJ8,$BM8,$BP8,$BS8)","v":0.36732785801003326},{"$f":"(Results!$F$16-$N8)*$AR$2","v":-2.9440000000000008},{"$f":"(1/SUMSQ(Results!$G$16,$O8))*$AR$2","v":5203.9966694421319},{"$f":"$AR8/SUM($AL8,$AO8,$AR8,$AU8,$AX8,$BA8,$BD8,$BG8,$BJ8,$BM8,$BP8,$BS8)","v":0.21073180197245039},{"$f":"(Results!$F$17-$P8)*$AU$2","v":-2.9669999999999987},{"$f":"(1/SUMSQ(Results!$G$17,$Q8))*$AU$2","v":4816.7236645633629},{"$f":"$AU8/SUM($AL8,$AO8,$AR8,$AU8,$AX8,$BA8,$BD8,$BG8,$BJ8,$BM8,$BP8,$BS8)","v":0.19504948252505205},{"$f":"(Results!$F$18-$R8)*$AX$2","v":-2.952},{"$f":"(1/SUMSQ(Results!$G$18,$S8))*$AX$2","v":2916.3871795619589},{"$f":"$AX8/SUM($AL8,$AO8,$AR8,$AU8,$AX8,$BA8,$BD8,$BG8,$BJ8,$BM8,$BP8,$BS8)","v":0.11809683299899697},{"$f":"(Results!$F$19-$T8)*$BA$2","v":-2.9359999999999999},{"$f":"(1/SUMSQ(Results!$G$19,$U8))*$BA$2","v":1440.9014279333148},{"$f":"$BA8/SUM($AL8,$AO8,$AR8,$AU8,$AX8,$BA8,$BD8,$BG8,$BJ8,$BM8,$BP8,$BS8)","v":5.8348183840328034E-2},{"$f":"(Results!$F$20-$V8)*$BD$2","v":-2.9600000000000009},{"$f":"(1/SUMSQ(Results!$G$20,$W8))*$BD$2","v":924.85549132947961},{"$f":"$BD8/SUM($AL8,$AO8,$AR8,$AU8,$AX8,$BA8,$BD8,$BG8,$BJ8,$BM8,$BP8,$BS8)","v":3.7451304570659941E-2},{"$f":"(Results!$F$21-$X8)*$BG$2","v":0},{"$f":"(1/SUMSQ(Results!$G$21,$Y8))*$BG$2","v":0},{"$f":"$BG8/SUM($AL8,$AO8,$AR8,$AU8,$AX8,$BA8,$BD8,$BG8,$BJ8,$BM8,$BP8,$BS8)","v":0},{"$f":"(Results!$F$22-$Z8)*$BJ$2","v":-2.927999999999999},{"$f":"(1/SUMSQ(Results!$G$22,$AA8))*$BJ$2","v":320.89851584436423},{"$f":"$BJ8/SUM($AL8,$AO8,$AR8,$AU8,$AX8,$BA8,$BD8,$BG8,$BJ8,$BM8,$BP8,$BS8)","v":1.2994536082479283E-2},{"$f":"(Results!$F$23-$AB8)*$BM$2","v":0},{"$f":"(1/SUMSQ(Results!$G$23,$AC8))*$BM$2","v":0},{"$f":"$BM8/SUM($AL8,$AO8,$AR8,$AU8,$AX8,$BA8,$BD8,$BG8,$BJ8,$BM8,$BP8,$BS8)","v":0},{"$f":"(Results!$F$24-$AD8)*$BP$2","v":0},{"$f":"(1/SUMSQ(Results!$G$24,$AE8))*$BP$2","v":0},{"$f":"$BP8/SUM($AL8,$AO8,$AR8,$AU8,$AX8,$BA8,$BD8,$BG8,$BJ8,$BM8,$BP8,$BS8)","v":0},{"$f":"(Results!$F$25-$AF8)*$BS$2","v":0},{"$f":"(1/SUMSQ(Results!$G$25,$AG8))*$BS$2","v":0},{"$f":"$BS8/SUM($AL8,$AO8,$AR8,$AU8,$AX8,$BA8,$BD8,$BG8,$BJ8,$BM8,$BP8,$BS8)","v":0},{"$f":"SUM($AK8*$AM8,$AN8*$AP8,$AQ8*$AS8,$AT8*$AV8,$AW8*$AY8,$AZ8*$BB8,$BC8*$BE8,$BF8*$BH8,$BI8*$BK8,$BL8*$BN8,$BO8*$BQ8,$BR8*$BT8)","v":-2.9519267305932266},{"$f":"IF($BV$2>1,SQRT(SUM((($AK8-$BU8)^2)*$AM8,(($AN8-$BU8)^2)*$AP8,(($AQ8-$BU8)^2)*$AS8,(($AT8-$BU8)^2)*$AV8,(($AW8-$BU8)^2)*$AY8,(($AZ8-$BU8)^2)*$BB8,(($BC8-$BU8)^2)*$BE8,(($BF8-$BU8)^2)*$BH8,(($BI8-$BU8)^2)*$BK8,(($BL8-$BU8)^2)*$BN8,(($BO8-$BU8)^2)*$BQ8,(($BR8-$BU8)^2)*$BT8)/(IF($BV$2=1,1,$BV$2-1))),1/SQRT(SUM($AL8,$AO8,$AR8,$AU8,$AX8,$BA8,$BD8,$BG8,$BJ8,$BM8,$BP8,$BS8)))","v":3.7093081045202949E-3},{"$f":"$H8+$BU8","v":15.398073269406774},{"$f":"SQRT(SUMSQ($I8,$BV8))","v":7.3194050076589287E-2},{"$f":"$J8+$BU8","v":11.961073269406773},{"$f":"SQRT(SUMSQ($K8,$BV8))","v":5.3822826583392984E-3},{"$f":"$L8+$BU8","v":12.664073269406773},{"$f":"SQRT(SUMSQ($M8,$BV8))","v":7.7458999873649247E-3},{"$f":"$N8+$BU8","v":13.090073269406775},{"$f":"SQRT(SUMSQ($O8,$BV8))","v":1.0291694059495742E-2},{"$f":"$P8+$BU8","v":13.454073269406772},{"$f":"SQRT(SUMSQ($Q8,$BV8))","v":1.3615027235164091E-2},{"$f":"$R8+$BU8","v":13.740073269406773},{"$f":"SQRT(SUMSQ($S8,$BV8))","v":1.7106985900919542E-2},{"$f":"$T8+$BU8","v":14.208073269406773},{"$f":"SQRT(SUMSQ($U8,$BV8))","v":2.5372602677184303E-2},{"$f":"$V8+$BU8","v":14.497073269406775},{"$f":"SQRT(SUMSQ($W8,$BV8))","v":3.2710991526003305E-2},{"$f":"$X8+$BU8","v":14.731073269406773},{"$f":"SQRT(SUMSQ($Y8,$BV8))","v":4.056992687464768E-2},{"$f":"$Z8+$BU8","v":15.088073269406772},{"$f":"SQRT(SUMSQ($AA8,$BV8))","v":5.562381654124661E-2},{"$f":"$AB8+$BU8","v":15.419073269406772},{"$f":"SQRT(SUMSQ($AC8,$BV8))","v":7.4392533003079422E-2},{"$f":"$AD8+$BU8","v":15.705073269406773},{"$f":"SQRT(SUMSQ($AE8,$BV8))","v":9.7670461075057183E-2},{"$f":"$AF8+$BU8","v":16.857073269406776},{"$f":"SQRT(SUMSQ($AG8,$BV8))","v":0.28052452471506706},{"$f":"IF(MOD(ROW($CW8)-7,oBlockAvg)=0,AVERAGE(INDIRECT(ADDRESS((INT((ROW($CW8)-7)/oBlockAvg)*oBlockAvg)+7,COLUMN(Calculation!JDGraph))&\":\"&ADDRESS(((INT((ROW($CW8)-7)/oBlockAvg)+1)*oBlockAvg)+6,COLUMN(Calculation!JDGraph)))),#N/A)","v":{"$error":"#N/A"}},{"$f":"IF(MOD(ROW($CX8)-7,oBlockAvg)=0,AVERAGE(INDIRECT(ADDRESS((INT((ROW($CX8)-7)/oBlockAvg)*oBlockAvg)+7,75)&\":\"&ADDRESS(((INT((ROW($CX8)-7)/oBlockAvg)+1)*oBlockAvg)+6,75))),#N/A)","v":{"$error":"#N/A"}},{"$f":"IF(MOD(ROW($CY8)-7,oBlockAvg)=0,STDEV(INDIRECT(ADDRESS((INT((ROW($CY8)-7)/oBlockAvg)*oBlockAvg)+7,75)&\":\"&ADDRESS(((INT((ROW($CY8)-7)/oBlockAvg)+1)*oBlockAvg)+6,75)))/SQRT(COUNT(INDIRECT(ADDRESS((INT((ROW($CY8)-7)/oBlockAvg)*oBlockAvg)+7,75)&\":\"&ADDRESS(((INT((ROW($CY8)-7)/oBlockAvg)+1)*oBlockAvg)+6,75)))),#N/A)","v":{"$error":"#N/A"}}]
[null,"Autosave Image -003V-DF.fit","2013-10-05","20:01:00",2456571.33403,{"$f":"E9-oJDOffset","v":3571.3340300000273},60,18.300999999999998,6.9800000000000001E-2,14.861000000000001,3.8E-3,15.561999999999999,6.4999999999999997E-3,16,9.1999999999999998E-3,16.372,1.26E-2,16.667000000000002,1.61E-2,17.145,2.46E-2,17.411000000000001,3.15E-2,17.695,4.0500000000000001E-2,18.04,5.5100000000000003E-2,18.292000000000002,6.8599999999999994E-2,18.670999999999999,9.8100000000000007E-2,19.829000000000001,0.28029999999999999,"Blank","Blank",0,{"$f":"(Results!$F$14-$J9)*$AL$2","v":0},{"$f":"(1/SUMSQ(Results!$G$14,$K9))*$AL$2","v":0},0,{"$f":"(Results!$F$15-$L9)*$AO$2","v":-2.8970000000000002},{"$f":"(1/SUMSQ(Results!$G$15,$M9))*$AO$2","v":9411.7647058823532},0.36396235709275682,{"$f":"(Results!$F$16-$N9)*$AR$2","v":-2.9019999999999992},{"$f":"(1/SUMSQ(Results!$G$16,$O9))*$AR$2","v":5415.9445407279027},0.20943999372349115,{"$f":"(Results!$F$17-$P9)*$AU$2","v":-2.9329999999999998},{"$f":"(1/SUMSQ(Results!$G$17,$Q9))*$AU$2","v":5134.5245430273153},0.19855720086827586,{"$f":"(Results!$F$18-$R9)*$AX$2","v":-2.9270000000000014},{"$f":"(1/SUMSQ(Results!$G$18,$S9))*$AX$2","v":3093.9636768664336},0.11964667071286597,{"$f":"(Results!$F$19-$T9)*$BA$2","v":-2.9209999999999994},{"$f":"(1/SUMSQ(Results!$G$19,$U9))*$BA$2","v":1494.4109032219499},5.7790364697688758E-2,{"$f":"(Results!$F$20-$V9)*$BD$2","v":-2.9220000000000006},{"$f":"(1/SUMSQ(Results!$G$20,$W9))*$BD$2","v":983.04251658884232},3.8015237592632492E-2,{"$f":"(Results!$F$21-$X9)*$BG$2","v":0},{"$f":"(1/SUMSQ(Results!$G$21,$Y9))*$BG$2","v":0},0,{"$f":"(Results!$F$22-$Z9)*$BJ$2","v":-2.927999999999999},{"$f":"(1/SUMSQ(Results!$G$22,$AA9))*$BJ$2","v":325.5197736986533},1.2588175312289155E-2,{"$f":"(Results!$F$23-$AB9)*$BM$2","v":0},{"$f":"(1/SUMSQ(Results!$G$23,$AC9))*$BM$2","v":0},0,{"$f":"(Results!$F$24-$AD9)*$BP$2","v":0},{"$f":"(1/SUMSQ(Results!$G$24,$AE9))*$BP$2","v":0},0,{"$f":"(Results!$F$25-$AF9)*$BS$2","v":0},{"$f":"(1/SUMSQ(Results!$G$25,$AG9))*$BS$2","v":0},0,-2.911512242448504,6.1750433866519889E-3,15.389487757551494,7.0072613486490104E-2,11.949487757551497,7.2505972738136863E-3,12.650487757551495,8.9655541282753111E-3,13.088487757551496,1.1080214836682296E-2,13.460487757551496,1.4031791076945041E-2,13.755487757551498,1.7243583178302428E-2,14.233487757551496,2.5363185147513206E-2,14.499487757551497,3.2099550788555198E-2,14.783487757551496,4.0968050488484738E-2,15.128487757551495,5.5444938099226286E-2,15.380487757551498,6.8877363195951641E-2,15.759487757551495,9.8294156290326007E-2,16.917487757551498,0.28036801023088748,{"$f":"IF(MOD(ROW($CW9)-7,oBlockAvg)=0,AVERAGE(INDIRECT(ADDRESS((INT((ROW($CW9)-7)/oBlockAvg)*oBlockAvg)+7,COLUMN(Calculation!JDGraph))&\":\"&ADDRESS(((INT((ROW($CW9)-7)/oBlockAvg)+1)*oBlockAvg)+6,COLUMN(Calculation!JDGraph)))),#N/A)","v":{"$error":"#N/A"}},{"$f":"IF(MOD(ROW($CX9)-7,oBlockAvg)=0,AVERAGE(INDIRECT(ADDRESS((INT((ROW($CX9)-7)/oBlockAvg)*oBlockAvg)+7,75)&\":\"&ADDRESS(((INT((ROW($CX9)-7)/oBlockAvg)+1)*oBlockAvg)+6,75))),#N/A)","v":{"$error":"#N/A"}},{"$f":"IF(MOD(ROW($CY9)-7,oBlockAvg)=0,STDEV(INDIRECT(ADDRESS((INT((ROW($CY9)-7)/oBlockAvg)*oBlockAvg)+7,75)&\":\"&ADDRESS(((INT((ROW($CY9)-7)/oBlockAvg)+1)*oBlockAvg)+6,75)))/SQRT(COUNT(INDIRECT(ADDRESS((INT((ROW($CY9)-7)/oBlockAvg)*oBlockAvg)+7,75)&\":\"&ADDRESS(((INT((ROW($CY9)-7)/oBlockAvg)+1)*oBlockAvg)+6,75)))),#N/A)","v":{"$error":"#N/A"}}]

{"sheet":"Data charts","index":5,"n_rows":34,"n_cols":17,"rows_kept":34,"cut":false,"hidden":false,"merged":[]}
[null,null,null,{"$f":"oVariableID","v":"VW Vul"},null,null,null,null,null,null,{"$f":"oVariableID","v":"VW Vul"},null,null,null,null,"Magnitude Axis Minimum & Maximum"]
[null,null,null,null,null,null,null,null,null,null,null,null,null,null,null,"For Middle Left, Bottom Left and Middle Right Charts"]
[null,null,null,null,null,null,null,null,null,null,null,null,null,null,null,"Bypass Automatic Min/Max","Yes"]
[null,null,null,null,null,null,null,null,null,null,null,null,null,null,null,"Round Min/Max to Nearest",1]
[null,null,null,null,null,null,null,null,null,null,null,null,null,null,null,"(No need to change settings unless magnitude axis is causing problems)"]
[]
[]
[]
[]
[]
[]
[]
[]
[]
[]
[]
[]
[]
[]
[]
[]
[]
[]
[]
[]
[]
[]
[]
[]
[]
[]
[]
[]
[null,null,null,null,null,null,null,null,null,null,{"$f":"oVariableID&\" Block Average\"","v":"VW Vul Block Average"}]

{"sheet":"Data charts AAVSO","index":6,"n_rows":1,"n_cols":11,"rows_kept":1,"cut":false,"hidden":false,"merged":[]}
[null,null,null,"Variable and Check Star",null,null,null,null,null,null,{"$f":"cAAVSO","v":"Variable and Check Star"}]

{"sheet":"BAAVSS","index":7,"n_rows":21,"n_cols":48,"rows_kept":21,"cut":false,"hidden":false,"merged":[]}
["File Format","CCD/DSLR v2.01"]
["Observation Method",{"$f":"uObservationMethod","v":"CCD"}]
["Variable",{"$f":"oVariableID","v":"VW Vul"}]
["Chart ID",{"$f":"oChartID","v":"AAVSO 12662FGO"}]
["Observer code",{"$f":"uObserverCode","v":"ABC"}]
["Location",{"$f":"uLatDeg&\" \"&uLatMin&\" \"&uLatSec&uLatHem&\" \"&uLongDeg&\" \"&uLongMin&\" \"&uLongSec&uLongHem&\" H\"&uHeight&\"m\"","v":"51 1 0N 1 1 0W H10m"}]
["Telescope",{"$f":"uTelescopeCode","v":"Meade 14 LX200R on AP1200"}]
["Camera",{"$f":"uCCDCode","v":"SXVR-H694"}]
["Magnitude type","Instrumental"]
["Timing uncertainty",{"$f":"uTimingUncertainty","v":30}]
["Phot star rad (arcsec)",{"$f":"((uPixelSize1+uPixelSize2)/2)*oStarAp","v":7.55}]
["Phot inner ann (arcsec)",{"$f":"((uPixelSize1+uPixelSize2)/2)*oSkyInn","v":11.324999999999999}]
["Phot outer ann (arcsec)",{"$f":"((uPixelSize1+uPixelSize2)/2)*oSkyOut","v":15.1}]
["Photometry software","AIP4Win v2 - Ensemble Photometry"]
["Analysis software",{"$f":"\"VSS CCD Photometry Spreadsheet \"&fVersion","v":"VSS CCD Photometry Spreadsheet 2.04"}]
["Comment",{"$f":"IF(oComment=\"\",\"\",oComment)","v":""}]
[]
["JulianDate","Filter","VarAbsMag","VarAbsErr","VarMag","VarErr","ExpLen","FileName","CmpStar","RefMag","RefErr","CMMag","CmpErr","CmpStar","RefMag","RefErr","CMMag","CmpErr","CmpStar","RefMag","RefErr","CMMag","CmpErr","CmpStar","RefMag","RefErr","CMMag","CmpErr","CmpStar","RefMag","RefErr","CMMag","CmpErr","CmpStar","RefMag","RefErr","CMMag","CmpErr","CmpStar","RefMag","RefErr","CMMag","CmpErr","CmpStar","RefMag","RefErr","CMMag","CmpErr"]
[2456571.3325700001,"V",15.372606399867795,7.4036516987994599E-2,18.356999999999999,7.3899999999999993E-2,60,"Autosave Image -001V-DF.fit",127,12.664999999999999,8.0000000000000002E-3,15.64,6.8999999999999999E-3,131,13.098000000000001,0.01,16.081,9.9000000000000008E-3,134,13.439,6.0000000000000001E-3,16.445,1.35E-2,137,13.74,8.0000000000000002E-3,16.721,1.72E-2,142,14.224,8.0000000000000002E-3,17.209,2.64E-2,145,14.489000000000001,5.0000000000000001E-3,17.484999999999999,3.3599999999999998E-2,151,15.112,6.0000000000000001E-3,18.09,5.79E-2,154,15.398999999999999,1.0999999999999999E-2,18.343,7.3400000000000007E-2]
[2456571.3333000001,"V",15.397930211732355,7.3182830370314492E-2,18.350000000000001,7.3099999999999998E-2,60,"Autosave Image -002V-DF.fit",127,12.664999999999999,8.0000000000000002E-3,15.616,6.7999999999999996E-3,131,13.098000000000001,0.01,16.042000000000002,9.5999999999999992E-3,134,13.439,6.0000000000000001E-3,16.405999999999999,1.3100000000000001E-2,137,13.74,8.0000000000000002E-3,16.692,1.67E-2,142,14.224,8.0000000000000002E-3,17.16,2.5100000000000001E-2,145,14.489000000000001,5.0000000000000001E-3,17.449000000000002,3.2500000000000001E-2,151,15.112,6.0000000000000001E-3,18.04,5.5500000000000001E-2,154,15.398999999999999,1.0999999999999999E-2,18.370999999999999,7.4300000000000005E-2]
[2456571.33403,"V",15.389634888917566,7.0034635001650969E-2,18.300999999999998,6.9800000000000001E-2,60,"Autosave Image -003V-DF.fit",127,12.664999999999999,8.0000000000000002E-3,15.561999999999999,6.4999999999999997E-3,131,13.098000000000001,0.01,16,9.1999999999999998E-3,134,13.439,6.0000000000000001E-3,16.372,1.26E-2,137,13.74,8.0000000000000002E-3,16.667000000000002,1.61E-2,142,14.224,8.0000000000000002E-3,17.145,2.46E-2,145,14.489000000000001,5.0000000000000001E-3,17.411000000000001,3.15E-2,151,15.112,6.0000000000000001E-3,18.04,5.5100000000000003E-2,154,15.398999999999999,1.0999999999999999E-2,18.292000000000002,6.8599999999999994E-2]

{"sheet":"AAVSO","index":8,"n_rows":11,"n_cols":15,"rows_kept":11,"cut":false,"hidden":false,"merged":[]}
["#TYPE=Extended"]
[{"$f":"\"#OBSCODE=\"&uAAVSOobservercode","v":"#OBSCODE=DEF"}]
[{"$f":"\"#SOFTWARE=\"&\"AIP4Winv2 BAAVSS Ss v\"&fVersion","v":"#SOFTWARE=AIP4Winv2 BAAVSS Ss v2.04"}]
[{"$f":"\"#DELIM=tab\"","v":"#DELIM=tab"}]
[{"$f":"\"#DATE=JD\"","v":"#DATE=JD"}]
[{"$f":"\"#OBSTYPE=CCD\"","v":"#OBSTYPE=CCD"}]
["#"]
["#NAME","DATE","MAG","MERR","FILT","TRANS","MTYPE","CNAME","CMAG","KNAME","KMAG","AIRMASS","GROUP","CHART","NOTES"]
["VW Vul",2456571.3325700001,15.372298900004894,7.4046372351045345E-2,"V","NO","ABS","ENSEMBLE","na",154,15.358298900004895,"na","na","AAVSO 12662FGO","na"]
["VW Vul",2456571.3333000001,15.398073269406774,7.3194050076589287E-2,"V","NO","ABS","ENSEMBLE","na",154,15.419073269406772,"na","na","AAVSO 12662FGO","na"]
["VW Vul",2456571.33403,15.389487757551494,7.0072613486490104E-2,"V","NO","ABS","ENSEMBLE","na",154,15.380487757551498,"na","na","AAVSO 12662FGO","na"]

{"sheet":"Image","index":9,"n_rows":1,"n_cols":1,"rows_kept":1,"cut":false,"hidden":false,"merged":[]}
["Image of field identifying variable and comparison stars."]

{"sheet":"Data","index":10,"n_rows":52,"n_cols":34,"rows_kept":52,"cut":false,"hidden":false,"merged":[]}
[]
["AIP4Win Multiple-Image Photometry Tool"]
["   Ensemble Photometry Report"]
["   AIP4Win Licensed to: ","Andrew Wilson"]
["   AIP4Win v.","2.4.0"]
["   Folder containing files:    ","C:\\Users\\User\\My Astronomy Images\\Processed\\Variable Stars\\VW Vul\\20131005"]
["   Filename of first image:    ","Autosave Image -001V-DF.fit"]
["   Number of files selected:   ",3]
["   Star aperture radius:       ",10]
["   Sky annulus inner radius:   ",15]
["   Sky annulus outer radius:   ",20]
["   Star aperture pixels:       ",312]
["   Sky annulus pixels:         ",330]
["   Default integration time:   ",60]
["   Zero point:                 ",25]
["   Gain [e/ADU]:               ",0.3]
["   Readout noise [e rms]:      ",5]
["   Dark current [e/sec/pix]:   ",1E-3]
["   Time of observation:"]
["   Date, time, exposure from   ","FITS header"]
["   First Image Date:           ",41552]
["   First Image Time:           ",0.8322222222222222]
["   First Exposure Time:        ","60     seconds"]
["   Filter:                     ","Johnson V"]
["     Clock time zone:          ","0 hours"]
["     Offset (true-clock):      ","0 seconds"]
["     Heliocentric correction:  ","0 seconds"]
["     Julian Day (midexposure): ImageTime + (Exposure / 2)"]
["   First Mid-exposure Date:    ",41552]
["   First Mid-exposure Time:    ",0.83256944444444436]
["Stars selected in the first image"]
["Star","  Star_X","  Star_Y","  Integr","    Max_PV","   Sky_ADU","  Star_ADU","     Mag","±Sigma"]
[" Var",621.83399999999995,615.89200000000005,60,4428,1571.9849999999999,27238.7,18.356999999999999,7.3899999999999993E-2]
["  C1",985.01300000000003,391.76799999999997,60,54484,1583.5509999999999,624054,14.957000000000001,4.1000000000000003E-3]
["  C2",532.01499999999999,281.24099999999999,60,38080,1582.2449999999999,332852,15.64,6.8999999999999999E-3]
["  C3",638.91700000000003,772.85299999999995,60,26348,1573.89,221666,16.081,9.9000000000000008E-3]
["  C4",572.86500000000001,940.13800000000003,60,19661,1579.076,158561.4,16.445,1.35E-2]
["  C5",308.99900000000002,452.90699999999998,60,14993,1579.3779999999999,122920.7,16.721,1.72E-2]
["  C6",402.43200000000002,593.06100000000004,60,10452,1573.0119999999999,78407.199999999997,17.209,2.64E-2]
["  C7","1901-10-16T01:20:38.400",632.74699999999996,60,8043,1572.4169999999999,60813.3,17.484999999999999,3.3599999999999998E-2]
["  C8","1901-11-20T05:21:07.200",515.38499999999999,60,6258,1582.1479999999999,46230.2,17.783000000000001,4.4400000000000002E-2]
["  C9","1901-07-24T21:53:16.800",428.73200000000003,60,5269,1572.36,34853.599999999999,18.09,5.79E-2]
[" C10","1901-03-10T11:02:24",698.92,60,4332,1570.299,27611.200000000001,18.343,7.3400000000000007E-2]
[" C11","1901-06-18T05:22:33.600",636.39499999999998,60,3808,1574.7270000000001,19558.18,18.716999999999999,0.1036]
[" C12","1901-11-03T19:22:04.800",618.22799999999995,60,2401,1576.4059999999999,6190.5,19.966000000000001,0.32390000000000002]
[" Ens","        ","        ","          ","          ",1733718,13.848000000000001,4.3E-3]
["-------------------------------------------------------------------"]
["Seq_#","YYYY-MM-DD","HH:MM:SS.sss","   Julian_Day","  Integr"," Filt","   V_Mag","±Sigma","      C1","±Sigma","      C2","±Sigma","      C3","±Sigma","      C4","±Sigma","      C5","±Sigma","      C6","±Sigma","      C7","±Sigma","      C8","±Sigma","      C9","±Sigma","     C10","±Sigma","     C11","±Sigma","     C12","±Sigma","   Sky_ADU","File_Name"]
[]
[1,"2013-10-05","19:58:54",2456571.3325700001,60," John",18.356999999999999,7.3899999999999993E-2,14.957000000000001,4.1000000000000003E-3,15.64,6.8999999999999999E-3,16.081,9.9000000000000008E-3,16.445,1.35E-2,16.721,1.72E-2,17.209,2.64E-2,17.484999999999999,3.3599999999999998E-2,17.783000000000001,4.4400000000000002E-2,18.09,5.79E-2,18.343,7.3400000000000007E-2,18.716999999999999,0.1036,19.966000000000001,0.32390000000000002,1571.9849999999999,"Autosave Image -001V-DF.fit"]
[2,"2013-10-05","19:59:57",2456571.3333000001,60," John",18.350000000000001,7.3099999999999998E-2,14.913,3.8999999999999998E-3,15.616,6.7999999999999996E-3,16.042000000000002,9.5999999999999992E-3,16.405999999999999,1.3100000000000001E-2,16.692,1.67E-2,17.16,2.5100000000000001E-2,17.449000000000002,3.2500000000000001E-2,17.683,4.0399999999999998E-2,18.04,5.5500000000000001E-2,18.370999999999999,7.4300000000000005E-2,18.657,9.7600000000000006E-2,19.809000000000001,0.28050000000000003,1559.31,"Autosave Image -002V-DF.fit"]
[3,"2013-10-05","20:01:00",2456571.33403,60," John",18.300999999999998,6.9800000000000001E-2,14.861000000000001,3.8E-3,15.561999999999999,6.4999999999999997E-3,16,9.1999999999999998E-3,16.372,1.26E-2,16.667000000000002,1.61E-2,17.145,2.46E-2,17.411000000000001,3.15E-2,17.695,4.0500000000000001E-2,18.04,5.5100000000000003E-2,18.292000000000002,6.8599999999999994E-2,18.670999999999999,9.8100000000000007E-2,19.829000000000001,0.28029999999999999,1537.1,"Autosave Image -003V-DF.fit"]

{"sheet":"Version Log","index":11,"n_rows":24,"n_cols":5,"rows_kept":24,"cut":false,"hidden":false,"merged":[]}
["Version","Changes / Fixes","Comment","Completion Date","Release Date"]
["2.0","Complete re-write for ensemble photometry",null,"2006-11-22","2006-11-22"]
["2.01Beta","Modified prcImportFile to copy Import Photometry file data to existing Data sheet rather than replace existing data sheet.","To enable VBA to work with Excel 2007 as well as previous versions.","2007-12-17","2008-07-06"]
["2.01Beta","Tested spreadsheet with AIP4Win v2.1.10.",null,"2007-12-23","2008-07-06"]
["2.01Beta2","Corrected \"Individual Variable Measurements\" table in Results sheet to be populated for all images, was previously missing calculations on the last image.","Did not affect any other calculations, i.e. all final calculations were correct.","2007-12-23","2008-07-06"]
["2.01Beta3","Changes for AIP4Win v2.2 data file format changes. Changed prcAIPv2EnsRawData to fncAIPv2EnsRawData to allow data read check. Changed Magnitude data copy from starting at fixed column to search for V_Mag column as new Filt column inserted in AIP4Win data file.","Calculations not affected.","2008-03-10","2008-07-06"]
["2.01Beta4","AAVSO output updated for new format. New CalcAAVSO sheet created for AAVSO version of calculation where Check star is not included. Results sheet modified to include row for AAVSO results and to allow a comparison to be used as a check star.",null,"2008-06-01","2008-07-06"]
["2.01Beta5","AAVSO export not creating blank entry for NOTES field beyond row 17. Field set to single space.",null,"2008-06-17","2008-07-06"]
["2.01Beta5","Filter codes changed to AAVSO codes.","Simpler if both BAAVSS and AAVSO use the same filter codes.","2008-06-17","2008-07-06"]
["2.01Beta5","Modified VBA for AAVSO output so that when only one comparison is selected then the details of the comparison star are used in the CNAME and CMAG fields rather than ENSEMBLE and na.","The CMAG ends up as the Chart magnitude for the comparison since this star is used to calculate the zero point for the image.","2008-06-17","2008-07-06"]
["2.01Beta6","Notes field in AAVSO output set to na.",null,"2008-06-17","2008-07-06"]
["2.01Beta7","Fixed Charts so that Check star appears.",null,"2008-06-17","2008-07-06"]
["2.01Beta8","Added VarAbsMag and VarAbsErr to BAAVSS output. Give the Variable Absolute (Original calculated by this spreadsheet) magnitude and errors.",null,"2008-07-06","2008-07-06"]
["2.01","Release of all 2.01Beta changes.",null,"2008-07-06","2008-07-06"]
["2.02","Updated filter list to keep in line with new AAVSO filters.","To assist when merging database results in future the BAAVSS and AAVSO try to use the same filter codes.","2009-01-26","2009-01-26"]
["2.03","Changes to enable this photometry spreadsheet to be used for DSLR as well as CCD observations.\nAltered ObsvEqmt sheet so that it contains an Observation Method field and remove explicit references to CCD with Camera.\nAltered BAAVSS sheet to include the Observation Method field.",null,"2013-05-05","2013-05-06"]
["2.03","Changes to aid future use in online submission.\nTo sheet BAAVSS added a File Format field.",null,"2013-05-05","2013-05-06"]
["2.03","Change for new online submission format.\nReplaced location code in BAAVSS sheet with location details.\nDisabled location code on ObsvEqmt sheet.\nIn ObsvEqmt sheet replaced Telescope Code with Telescope Short Description.\nIn BAAVSS sheet replaced Telescope Code with Telescope.",null,"2013-05-06","2013-05-06"]
["2.04","Added optional Airmass to Results tab for use in AAVSO output.",null,"2017-12-29","2017-12-30"]
["2.04","Added comment to Results tab.",null,"2017-12-29","2017-12-30"]
["2.04","Added new AAVSO charts sheet, to show variable in comparison to the check star.",null,"2013-09-21","2017-12-30"]
["2.04","In Results tab corrected headings M10 and N10 which showed Max and Min the wrong way round.",null,"2013-11-21","2017-12-30"]
["2.04","Added filter VG for \"Corrected Green Channel to Johnson V\".",null,"2013-12-21","2017-12-30"]
["2.04","Corrected format of CMAG column in AAVSO tab from Text to Number.",null,"2014-05-24","2017-12-30"]